"molecule_id","FCFP4_1024b560","FCFP4_1024b616","FCFP4_1024b885","FCFP4_1024b759","FCFP4_1024b151","FCFP4_1024b600","FCFP4_1024b825","FCFP4_1024b521","FCFP4_1024b557","FCFP4_1024b377","FCFP4_1024b126","FCFP4_1024b867","FCFP4_1024b974","FCFP4_1024b1","FCFP4_1024b10","FCFP4_1024b100","FCFP4_1024b1000","FCFP4_1024b1001","FCFP4_1024b1002","FCFP4_1024b1003","FCFP4_1024b1004","FCFP4_1024b1005","FCFP4_1024b1006","FCFP4_1024b1007","FCFP4_1024b1008","FCFP4_1024b1009","FCFP4_1024b101","FCFP4_1024b1010","FCFP4_1024b1011","FCFP4_1024b1012","FCFP4_1024b1013","FCFP4_1024b1014","FCFP4_1024b1015","FCFP4_1024b1016","FCFP4_1024b1017","FCFP4_1024b1018","FCFP4_1024b1019","FCFP4_1024b102","FCFP4_1024b1020","FCFP4_1024b1021","FCFP4_1024b1022","FCFP4_1024b1023","FCFP4_1024b1024","FCFP4_1024b103","FCFP4_1024b104","FCFP4_1024b105","FCFP4_1024b106","FCFP4_1024b107","FCFP4_1024b108","FCFP4_1024b109","FCFP4_1024b11","pXC50"
{1 1,2 1,3 1,4 1,5 1,8 1,9 1,14 1,48 1,49 1,52 4.523}
{0 CHEMBL105999,1 1,2 1,3 1,4 1,5 1,8 1,9 1,10 1,12 1,14 1,48 1,49 1,52 4.509}
{0 CHEMBL106077,1 1,2 1,3 1,4 1,5 1,8 1,9 1,10 1,12 1,14 1,48 1,49 1,52 4.244}
{0 CHEMBL106194,1 1,2 1,3 1,4 1,5 1,8 1,9 1,14 1,15 1,48 1,49 1,52 4.495}
{0 CHEMBL106479,1 1,2 1,3 1,4 1,5 1,8 1,9 1,14 1,48 1,49 1,52 4.481}
{0 CHEMBL107206,1 1,2 1,3 1,4 1,5 1,8 1,9 1,14 1,40 1,48 1,52 4}
{0 CHEMBL107245,1 1,2 1,3 1,4 1,5 1,8 1,9 1,14 1,48 1,49 1,51 1,52 4}
{0 CHEMBL107355,1 1,2 1,3 1,4 1,5 1,8 1,9 1,14 1,48 1,49 1,52 4}
{0 CHEMBL108128,1 1,2 1,3 1,4 1,5 1,8 1,9 1,10 1,12 1,14 1,48 1,49 1,52 4.602}
{0 CHEMBL1081579,14 1,21 1,48 1,52 4}
{0 CHEMBL108328,1 1,2 1,3 1,4 1,5 1,8 1,9 1,10 1,14 1,48 1,49 1,52 4}
{0 CHEMBL108394,7 1,9 1,14 1,52 4.939}
{0 CHEMBL108441,7 1,14 1,52 4.936}
{0 CHEMBL108584,1 1,2 1,3 1,4 1,5 1,8 1,9 1,14 1,48 1,49 1,52 4.409}
{0 CHEMBL108689,1 1,2 1,3 1,4 1,5 1,8 1,9 1,10 1,14 1,48 1,49 1,52 4.301}
{0 CHEMBL108690,1 1,2 1,3 1,4 1,5 1,8 1,9 1,14 1,48 1,49 1,52 4.469}
{0 CHEMBL108721,8 1,13 1,14 1,32 1,39 1,52 5.102}
{0 CHEMBL108779,1 1,2 1,3 1,4 1,5 1,8 1,9 1,10 1,14 1,48 1,49 1,52 4}
{0 CHEMBL108880,1 1,2 1,3 1,4 1,5 1,8 1,9 1,10 1,14 1,48 1,49 1,52 4}
{0 CHEMBL109118,1 1,2 1,3 1,4 1,5 1,8 1,9 1,10 1,12 1,14 1,48 1,49 1,52 4.678}
{0 CHEMBL109357,7 1,14 1,52 5.036}
{0 CHEMBL109642,7 1,14 1,52 4.975}
{0 CHEMBL109672,7 1,14 1,31 1,52 4.893}
{0 CHEMBL110432,1 1,2 1,3 1,4 1,8 1,9 1,14 1,48 1,52 4.62}
{0 CHEMBL110566,1 1,2 1,3 1,4 1,5 1,8 1,9 1,14 1,48 1,49 1,52 4.398}
{0 CHEMBL110642,14 1,52 5.022}
{0 CHEMBL110762,1 1,2 1,3 1,4 1,5 1,8 1,9 1,14 1,48 1,49 1,52 4.699}
{0 CHEMBL110838,1 1,2 1,3 1,4 1,5 1,8 1,9 1,14 1,48 1,49 1,52 4.602}
{0 CHEMBL110922,1 1,2 1,3 1,4 1,5 1,8 1,9 1,10 1,12 1,14 1,48 1,49 1,52 4.509}
{0 CHEMBL111092,7 1,14 1,31 1,52 5.337}
{0 CHEMBL111180,7 1,14 1,52 4.939}
{0 CHEMBL111191,7 1,14 1,31 1,52 5.398}
{0 CHEMBL111387,7 1,9 1,14 1,52 4.403}
{0 CHEMBL111454,14 1,52 4}
{0 CHEMBL113497,7 1,9 1,14 1,49 1,52 4}
{0 CHEMBL1224683,14 1,15 1,19 1,52 6.143}
{0 CHEMBL1271266,14 1,52 6.314}
{0 CHEMBL128320,7 1,8 1,9 1,13 1,14 1,52 5}
{0 CHEMBL128764,8 1,14 1,52 5}
{0 CHEMBL128830,7 1,8 1,13 1,14 1,23 1,48 1,52 5}
{0 CHEMBL1301019,14 1,31 1,52 5.766}
{0 CHEMBL1301020,14 1,52 4.068}
{0 CHEMBL1301519,14 1,15 1,19 1,20 1,48 1,52 5.67}
{0 CHEMBL1301776,8 1,14 1,48 1,51 1,52 4.943}
{0 CHEMBL1302298,14 1,48 1,52 5.183}
{0 CHEMBL1303831,14 1,28 1,48 1,52 4.416}
{0 CHEMBL1304193,14 1,15 1,19 1,52 5.674}
{0 CHEMBL1304265,8 1,14 1,48 1,52 5.372}
{0 CHEMBL1304345,5 1,8 1,13 1,14 1,30 1,44 1,52 5.742}
{0 CHEMBL1304974,4 1,8 1,9 1,14 1,30 1,52 4.873}
{0 CHEMBL1305050,8 1,14 1,28 1,48 1,52 5.347}
{0 CHEMBL1305463,14 1,48 1,52 4}
{0 CHEMBL1308781,14 1,52 4.134}
{0 CHEMBL1310336,8 1,14 1,37 1,48 1,52 5.564}
{0 CHEMBL131141,7 1,8 1,9 1,13 1,14 1,23 1,52 4.77}
{0 CHEMBL1313807,3 1,8 1,14 1,46 1,52 4.951}
{0 CHEMBL1314093,8 1,14 1,37 1,48 1,52 6.157}
{0 CHEMBL1314311,8 1,14 1,28 1,48 1,52 5.563}
{0 CHEMBL1314584,8 1,14 1,48 1,52 6.095}
{0 CHEMBL131657,8 1,13 1,14 1,15 1,19 1,52 5}
{0 CHEMBL1321572,14 1,52 4.983}
{0 CHEMBL132160,8 1,13 1,14 1,52 5}
{0 CHEMBL1321933,8 1,14 1,29 1,48 1,52 5.542}
{0 CHEMBL1322542,14 1,48 1,52 5.563}
{0 CHEMBL132324,14 1,52 5}
{0 CHEMBL1324382,14 1,28 1,37 1,52 5.373}
{0 CHEMBL1325249,5 1,14 1,52 4.483}
{0 CHEMBL1325664,14 1,52 5.422}
{0 CHEMBL1325709,8 1,14 1,48 1,51 1,52 5.545}
{0 CHEMBL1325945,14 1,20 1,36 1,52 5.256}
{0 CHEMBL1329141,8 1,14 1,40 1,52 5.91}
{0 CHEMBL1329178,6 1,8 1,14 1,52 4.554}
{0 CHEMBL1329712,8 1,14 1,48 1,51 1,52 6.115}
{0 CHEMBL1330962,8 1,14 1,46 1,52 4.572}
{0 CHEMBL1331139,8 1,14 1,15 1,19 1,52 6.001}
{0 CHEMBL1331149,9 1,14 1,15 1,48 1,52 6.466}
{0 CHEMBL1331791,6 1,14 1,52 4.618}
{0 CHEMBL1333386,8 1,14 1,24 1,52 4.807}
{0 CHEMBL1333409,14 1,21 1,28 1,52 4.095}
{0 CHEMBL1334491,14 1,23 1,48 1,52 5.987}
{0 CHEMBL1334970,14 1,28 1,48 1,52 5.287}
{0 CHEMBL1340607,9 1,14 1,15 1,48 1,52 6.143}
{0 CHEMBL1343331,14 1,48 1,52 4.854}
{0 CHEMBL1344075,14 1,15 1,19 1,52 6.028}
{0 CHEMBL1345966,14 1,20 1,39 1,45 1,52 5.287}
{0 CHEMBL1349331,8 1,14 1,48 1,51 1,52 4.738}
{0 CHEMBL1349451,8 1,14 1,24 1,52 5.596}
{0 CHEMBL1349800,2 1,8 1,14 1,15 1,48 1,52 5.907}
{0 CHEMBL1350887,8 1,14 1,48 1,52 6.145}
{0 CHEMBL1353918,14 1,15 1,37 1,39 1,48 1,52 6.465}
{0 CHEMBL1354127,8 1,14 1,52 4.315}
{0 CHEMBL1359614,8 1,14 1,28 1,40 1,48 1,52 5.249}
{0 CHEMBL1360394,8 1,14 1,37 1,48 1,52 5.306}
{0 CHEMBL1362650,7 1,8 1,14 1,26 1,27 1,48 1,52 6.106}
{0 CHEMBL1363824,9 1,14 1,32 1,48 1,52 4.183}
{0 CHEMBL1364175,14 1,21 1,52 5.575}
{0 CHEMBL1364192,14 1,48 1,52 5.409}
{0 CHEMBL1367604,14 1,15 1,19 1,52 5.848}
{0 CHEMBL1368444,8 1,14 1,15 1,52 5.431}
{0 CHEMBL1368667,8 1,14 1,21 1,48 1,51 1,52 5.074}
{0 CHEMBL1369492,8 1,9 1,14 1,48 1,49 1,52 4.824}
{0 CHEMBL1370165,8 1,14 1,28 1,48 1,52 6.452}
{0 CHEMBL1371777,8 1,14 1,52 4.706}
{0 CHEMBL1371869,8 1,14 1,24 1,28 1,40 1,52 5.903}
{0 CHEMBL1372387,4 1,8 1,9 1,14 1,30 1,52 4.796}
{0 CHEMBL1373132,14 1,52 5.703}
{0 CHEMBL1373210,14 1,48 1,52 5.45}
{0 CHEMBL1376711,8 1,14 1,40 1,52 5.91}
{0 CHEMBL1377966,14 1,52 4.086}
{0 CHEMBL1381413,8 1,14 1,20 1,23 1,39 1,45 1,51 1,52 6.465}
{0 CHEMBL1381758,14 1,15 1,52 5.889}
{0 CHEMBL1383849,14 1,48 1,52 5.161}
{0 CHEMBL1383966,8 1,14 1,28 1,39 1,52 5.523}
{0 CHEMBL1384370,8 1,14 1,39 1,52 5.802}
{0 CHEMBL1384779,14 1,15 1,52 5.62}
{0 CHEMBL1385743,8 1,14 1,15 1,48 1,52 5.811}
{0 CHEMBL1385949,14 1,15 1,20 1,23 1,48 1,52 5.68}
{0 CHEMBL1387238,8 1,14 1,20 1,48 1,52 5.503}
{0 CHEMBL1387426,8 1,14 1,29 1,48 1,52 5.245}
{0 CHEMBL1387693,8 1,14 1,20 1,52 5.411}
{0 CHEMBL1390703,2 1,8 1,13 1,14 1,28 1,44 1,52 4.857}
{0 CHEMBL1390963,8 1,14 1,24 1,52 5.137}
{0 CHEMBL1391676,14 1,52 4}
{0 CHEMBL1392728,8 1,14 1,19 1,24 1,28 1,40 1,52 5.625}
{0 CHEMBL1393151,8 1,14 1,28 1,48 1,52 5.458}
{0 CHEMBL1393788,6 1,8 1,14 1,29 1,52 5.297}
{0 CHEMBL1398814,9 1,14 1,48 1,52 5.337}
{0 CHEMBL1403526,8 1,14 1,52 4.595}
{0 CHEMBL1404406,14 1,15 1,19 1,31 1,52 4.405}
{0 CHEMBL1405203,14 1,15 1,19 1,52 6.026}
{0 CHEMBL1405311,14 1,40 1,52 5.64}
{0 CHEMBL1405584,9 1,14 1,15 1,31 1,52 4.616}
{0 CHEMBL1406679,14 1,48 1,52 5.154}
{0 CHEMBL1407021,14 1,48 1,52 4.967}
{0 CHEMBL1407203,11 1,14 1,44 1,52 5.401}
{0 CHEMBL1407368,14 1,48 1,52 5.765}
{0 CHEMBL1408579,14 1,48 1,52 5.613}
{0 CHEMBL1410244,14 1,15 1,19 1,52 6.467}
{0 CHEMBL1411223,14 1,48 1,52 4}
{0 CHEMBL1412602,14 1,52 5.513}
{0 CHEMBL1412803,8 1,14 1,39 1,52 5.511}
{0 CHEMBL1413291,14 1,48 1,52 4}
{0 CHEMBL1414573,14 1,37 1,52 4.578}
{0 CHEMBL1414679,14 1,52 4.91}
{0 CHEMBL1416366,6 1,9 1,14 1,15 1,31 1,44 1,48 1,52 4}
{0 CHEMBL1416769,14 1,48 1,52 4}
{0 CHEMBL1417141,14 1,46 1,52 5.434}
{0 CHEMBL1418454,14 1,52 4.611}
{0 CHEMBL1418840,14 1,27 1,52 6.137}
{0 CHEMBL1419452,8 1,14 1,15 1,48 1,52 5.379}
{0 CHEMBL1421461,9 1,14 1,15 1,19 1,52 4.213}
{0 CHEMBL1421470,9 1,14 1,15 1,48 1,52 6.303}
{0 CHEMBL1421970,3 1,8 1,14 1,38 1,48 1,52 5.585}
{0 CHEMBL1422255,2 1,14 1,17 1,48 1,52 4}
{0 CHEMBL1423213,14 1,15 1,48 1,52 4.285}
{0 CHEMBL1424189,14 1,52 5.495}
{0 CHEMBL1424694,7 1,14 1,28 1,52 5.91}
{0 CHEMBL1425948,14 1,28 1,48 1,52 4}
{0 CHEMBL1426299,14 1,15 1,19 1,52 6.47}
{0 CHEMBL1429265,14 1,15 1,19 1,20 1,48 1,52 5.463}
{0 CHEMBL1429931,9 1,14 1,52 4.539}
{0 CHEMBL1430499,8 1,14 1,36 1,39 1,52 5.366}
{0 CHEMBL1430983,14 1,52 5.391}
{0 CHEMBL1431178,14 1,37 1,52 4.442}
{0 CHEMBL1432675,14 1,48 1,52 5.967}
{0 CHEMBL1433062,14 1,20 1,39 1,52 6.079}
{0 CHEMBL1434855,14 1,52 5.593}
{0 CHEMBL1438892,8 1,14 1,15 1,37 1,48 1,52 5.611}
{0 CHEMBL1439815,8 1,14 1,34 1,52 4.955}
{0 CHEMBL1441524,14 1,23 1,52 4.259}
{0 CHEMBL1441794,14 1,52 5.588}
{0 CHEMBL1445488,4 1,8 1,9 1,14 1,30 1,52 5.433}
{0 CHEMBL1445886,8 1,14 1,48 1,51 1,52 5.573}
{0 CHEMBL1447397,14 1,15 1,19 1,48 1,52 5.52}
{0 CHEMBL1448180,8 1,14 1,37 1,52 4.36}
{0 CHEMBL1448629,8 1,14 1,24 1,52 4}
{0 CHEMBL1449334,8 1,14 1,52 4.53}
{0 CHEMBL1449836,8 1,14 1,52 5.151}
{0 CHEMBL145,9 1,14 1,49 1,52 4}
{0 CHEMBL1451261,14 1,15 1,19 1,52 5.717}
{0 CHEMBL1451516,8 1,14 1,39 1,52 4.554}
{0 CHEMBL1451962,14 1,52 5.444}
{0 CHEMBL1452827,6 1,14 1,48 1,52 4}
{0 CHEMBL1452898,14 1,15 1,19 1,48 1,52 4}
{0 CHEMBL1452974,8 1,14 1,24 1,40 1,52 5.354}
{0 CHEMBL1453902,8 1,14 1,48 1,52 5.468}
{0 CHEMBL1455226,8 1,14 1,40 1,52 5.91}
{0 CHEMBL1455260,14 1,52 4.116}
{0 CHEMBL1457385,14 1,48 1,52 4}
{0 CHEMBL1457922,8 1,14 1,52 4.44}
{0 CHEMBL1460292,14 1,48 1,52 4.097}
{0 CHEMBL1460464,14 1,52 4.131}
{0 CHEMBL1460470,6 1,14 1,37 1,40 1,52 5.91}
{0 CHEMBL1461216,14 1,37 1,48 1,52 6.293}
{0 CHEMBL1461661,14 1,48 1,52 4.046}
{0 CHEMBL1462768,14 1,37 1,40 1,48 1,52 4}
{0 CHEMBL1463248,8 1,14 1,48 1,52 6.788}
{0 CHEMBL1463659,8 1,14 1,20 1,41 1,52 4.991}
{0 CHEMBL1464219,14 1,52 4.149}
{0 CHEMBL1466912,14 1,52 5.386}
{0 CHEMBL1467028,9 1,14 1,52 5.479}
{0 CHEMBL1467623,14 1,46 1,52 5.651}
{0 CHEMBL1470219,8 1,14 1,48 1,52 4}
{0 CHEMBL1470628,8 1,14 1,15 1,19 1,37 1,48 1,52 5.866}
{0 CHEMBL1471409,14 1,15 1,52 5.397}
{0 CHEMBL1477633,14 1,39 1,52 5.495}
{0 CHEMBL1477806,8 1,14 1,52 4}
{0 CHEMBL1478082,14 1,52 6.108}
{0 CHEMBL1478587,8 1,14 1,34 1,52 5.363}
{0 CHEMBL1478726,14 1,48 1,52 4}
{0 CHEMBL1479796,8 1,14 1,39 1,52 4.4}
{0 CHEMBL1480960,9 1,14 1,28 1,48 1,49 1,52 5.268}
{0 CHEMBL1483335,8 1,14 1,28 1,40 1,52 4.475}
{0 CHEMBL1484595,14 1,52 5.52}
{0 CHEMBL1484942,6 1,14 1,52 4.324}
{0 CHEMBL1485717,14 1,15 1,19 1,52 6.092}
{0 CHEMBL1487101,14 1,15 1,19 1,52 5.886}
{0 CHEMBL1487426,8 1,14 1,48 1,51 1,52 4.097}
{0 CHEMBL1489230,8 1,14 1,28 1,40 1,52 5.388}
{0 CHEMBL1489399,14 1,15 1,19 1,52 6.131}
{0 CHEMBL1489619,14 1,52 4.064}
{0 CHEMBL1489711,9 1,14 1,48 1,52 5.245}
{0 CHEMBL1490505,8 1,14 1,52 4.545}
{0 CHEMBL1493126,8 1,14 1,38 1,52 4.246}
{0 CHEMBL1500616,2 1,8 1,13 1,14 1,15 1,44 1,48 1,52 5.519}
{0 CHEMBL1501132,8 1,14 1,48 1,52 6.308}
{0 CHEMBL1502703,14 1,15 1,52 5.57}
{0 CHEMBL1503182,14 1,48 1,52 5.821}
{0 CHEMBL1504939,14 1,15 1,19 1,48 1,52 5.234}
{0 CHEMBL1505246,14 1,15 1,19 1,52 4.004}
{0 CHEMBL1505300,14 1,20 1,48 1,52 5.917}
{0 CHEMBL1505471,8 1,14 1,52 5.798}
{0 CHEMBL1506021,9 1,14 1,52 5.453}
{0 CHEMBL1506538,14 1,15 1,48 1,52 5.951}
{0 CHEMBL1509369,9 1,14 1,52 5.144}
{0 CHEMBL1511981,14 1,28 1,37 1,48 1,52 5.896}
{0 CHEMBL1515727,14 1,20 1,48 1,52 5.179}
{0 CHEMBL1517266,14 1,21 1,37 1,38 1,48 1,52 5.297}
{0 CHEMBL1518926,2 1,8 1,13 1,14 1,44 1,48 1,52 5.507}
{0 CHEMBL1519586,8 1,14 1,52 4.108}
{0 CHEMBL1523808,8 1,14 1,48 1,52 5.18}
{0 CHEMBL1526088,14 1,48 1,52 5.424}
{0 CHEMBL1526669,8 1,14 1,24 1,40 1,52 4.917}
{0 CHEMBL1528944,14 1,52 5.91}
{0 CHEMBL1528986,8 1,13 1,14 1,15 1,44 1,52 5.604}
{0 CHEMBL1529185,14 1,18 1,37 1,48 1,52 5.879}
{0 CHEMBL1529345,14 1,28 1,37 1,52 5.37}
{0 CHEMBL1529616,3 1,8 1,14 1,38 1,39 1,52 4.52}
{0 CHEMBL1530046,8 1,14 1,24 1,52 4}
{0 CHEMBL1530080,8 1,14 1,28 1,40 1,52 5.374}
{0 CHEMBL1530487,14 1,48 1,51 1,52 4.64}
{0 CHEMBL1531641,8 1,14 1,28 1,37 1,51 1,52 5.22}
{0 CHEMBL1532240,9 1,14 1,48 1,49 1,52 4}
{0 CHEMBL1533277,14 1,48 1,52 5.339}
{0 CHEMBL1535692,8 1,14 1,46 1,52 5.409}
{0 CHEMBL1536551,14 1,15 1,19 1,52 4}
{0 CHEMBL1536896,4 1,8 1,9 1,14 1,30 1,52 5.889}
{0 CHEMBL1537120,14 1,15 1,39 1,52 4.393}
{0 CHEMBL1537922,14 1,15 1,48 1,52 5.601}
{0 CHEMBL1540065,14 1,15 1,19 1,20 1,48 1,52 6.301}
{0 CHEMBL1540317,8 1,14 1,37 1,48 1,52 6.246}
{0 CHEMBL1545441,14 1,15 1,48 1,52 6.123}
{0 CHEMBL1547640,14 1,48 1,52 5.365}
{0 CHEMBL1548812,14 1,52 5.368}
{0 CHEMBL1550032,14 1,46 1,52 5.807}
{0 CHEMBL1552163,8 1,14 1,52 5.143}
{0 CHEMBL1555904,14 1,52 4.48}
{0 CHEMBL1558648,14 1,15 1,48 1,52 5.987}
{0 CHEMBL1562016,9 1,14 1,52 4.472}
{0 CHEMBL1564440,14 1,48 1,52 5.536}
{0 CHEMBL1566081,9 1,14 1,52 5.223}
{0 CHEMBL1566674,14 1,15 1,19 1,48 1,52 5.398}
{0 CHEMBL1568683,8 1,14 1,48 1,52 5.171}
{0 CHEMBL1569076,14 1,48 1,52 4.454}
{0 CHEMBL1569105,14 1,15 1,48 1,52 5.863}
{0 CHEMBL1569872,8 1,14 1,48 1,52 5.025}
{0 CHEMBL1569991,8 1,14 1,15 1,52 6.244}
{0 CHEMBL1570992,3 1,8 1,14 1,39 1,51 1,52 4.148}
{0 CHEMBL1576545,8 1,14 1,48 1,51 1,52 4.917}
{0 CHEMBL1578067,6 1,14 1,37 1,52 4}
{0 CHEMBL1578670,8 1,14 1,52 5.706}
{0 CHEMBL1580036,8 1,14 1,52 5.987}
{0 CHEMBL1580684,14 1,48 1,52 5.373}
{0 CHEMBL1584150,8 1,13 1,14 1,48 1,52 5.604}
{0 CHEMBL1584392,14 1,48 1,52 4.889}
{0 CHEMBL1585855,8 1,14 1,52 5.336}
{0 CHEMBL1586360,14 1,15 1,19 1,52 5.943}
{0 CHEMBL1586977,6 1,8 1,14 1,39 1,52 4.57}
{0 CHEMBL1594597,8 1,29 1,52 4.595}
{0 CHEMBL1595008,14 1,36 1,52 4.008}
{0 CHEMBL1595181,8 1,14 1,38 1,48 1,52 5.807}
{0 CHEMBL1597485,14 1,15 1,19 1,48 1,52 4.812}
{0 CHEMBL1603145,14 1,48 1,52 4.541}
{0 CHEMBL1603381,8 1,14 1,24 1,40 1,52 5.91}
{0 CHEMBL1605157,8 1,52 5.752}
{0 CHEMBL1605172,14 1,15 1,19 1,52 5.438}
{0 CHEMBL1607593,8 1,14 1,33 1,52 4.301}
{0 CHEMBL1608180,2 1,8 1,14 1,48 1,52 5.79}
{0 CHEMBL1608642,14 1,52 6.459}
{0 CHEMBL1608654,8 1,14 1,28 1,37 1,40 1,52 5.235}
{0 CHEMBL1609429,14 1,52 5.159}
{0 CHEMBL1612116,14 1,52 5.587}
{0 CHEMBL1612148,8 1,14 1,28 1,40 1,52 4.437}
{0 CHEMBL1672291,14 1,52 4.71}
{0 CHEMBL1672292,14 1,52 5.217}
{0 CHEMBL1672293,14 1,52 5.071}
{0 CHEMBL1672294,14 1,37 1,52 5.187}
{0 CHEMBL1672295,14 1,52 5.051}
{0 CHEMBL1672296,8 1,14 1,33 1,52 4.301}
{0 CHEMBL1698303,11 1,14 1,44 1,52 4}
{0 CHEMBL1699305,6 1,14 1,37 1,52 4.388}
{0 CHEMBL1701224,3 1,8 1,14 1,37 1,51 1,52 5.743}
{0 CHEMBL1701471,6 1,14 1,37 1,52 4}
{0 CHEMBL1702283,6 1,11 1,14 1,44 1,49 1,52 4}
{0 CHEMBL1702302,6 1,14 1,37 1,52 4.216}
{0 CHEMBL1702303,6 1,14 1,52 5.58}
{0 CHEMBL1703811,6 1,11 1,14 1,44 1,52 4}
{0 CHEMBL1704002,14 1,15 1,19 1,48 1,52 4}
{0 CHEMBL1704444,14 1,48 1,52 4.516}
{0 CHEMBL1704720,6 1,14 1,52 4.821}
{0 CHEMBL1704984,14 1,15 1,19 1,31 1,48 1,52 4}
{0 CHEMBL1705618,14 1,15 1,19 1,48 1,52 4}
{0 CHEMBL1705741,6 1,14 1,37 1,52 4.854}
{0 CHEMBL1708418,11 1,14 1,44 1,52 4.002}
{0 CHEMBL1708751,14 1,52 4.002}
{0 CHEMBL1708762,8 1,9 1,14 1,28 1,52 4.79}
{0 CHEMBL1708834,11 1,14 1,44 1,52 4.002}
{0 CHEMBL1709810,14 1,52 4.685}
{0 CHEMBL1710168,6 1,14 1,52 4.484}
{0 CHEMBL1710618,14 1,48 1,52 4}
{0 CHEMBL1711927,6 1,14 1,52 4.87}
{0 CHEMBL1712133,2 1,8 1,14 1,15 1,19 1,48 1,52 4}
{0 CHEMBL1713322,6 1,14 1,52 4}
{0 CHEMBL1713941,6 1,14 1,52 4}
{0 CHEMBL1714422,9 1,14 1,37 1,49 1,52 5.604}
{0 CHEMBL1714877,14 1,52 4.289}
{0 CHEMBL1714887,6 1,14 1,37 1,52 4.144}
{0 CHEMBL1714980,14 1,48 1,52 4}
{0 CHEMBL1715328,8 1,14 1,52 4.218}
{0 CHEMBL1715760,6 1,11 1,14 1,44 1,52 4}
{0 CHEMBL1716347,6 1,14 1,52 4.061}
{0 CHEMBL1716867,14 1,48 1,52 4}
{0 CHEMBL1717227,6 1,14 1,37 1,52 4}
{0 CHEMBL1717901,6 1,11 1,14 1,44 1,52 4}
{0 CHEMBL1717981,6 1,14 1,37 1,49 1,52 4}
{0 CHEMBL1718472,14 1,37 1,52 4}
{0 CHEMBL1719276,11 1,14 1,44 1,52 4.07}
{0 CHEMBL1719539,6 1,14 1,52 4.002}
{0 CHEMBL1719568,14 1,15 1,19 1,52 4}
{0 CHEMBL1720016,6 1,14 1,52 4.186}
{0 CHEMBL1721094,14 1,37 1,38 1,52 5.582}
{0 CHEMBL1721258,14 1,37 1,48 1,52 4}
{0 CHEMBL1721385,14 1,52 4.002}
{0 CHEMBL1721577,8 1,14 1,52 5.11}
{0 CHEMBL1721618,14 1,48 1,52 4.747}
{0 CHEMBL1722185,6 1,14 1,52 5.519}
{0 CHEMBL1723290,14 1,15 1,19 1,48 1,52 4.419}
{0 CHEMBL1723513,14 1,48 1,52 4.173}
{0 CHEMBL1724282,9 1,14 1,52 6.264}
{0 CHEMBL1724311,14 1,52 4.471}
{0 CHEMBL1724547,14 1,52 4.604}
{0 CHEMBL1725341,6 1,11 1,14 1,44 1,52 4}
{0 CHEMBL1725497,14 1,52 5.393}
{0 CHEMBL1726168,14 1,48 1,52 4}
{0 CHEMBL1727280,14 1,52 4.002}
{0 CHEMBL1727475,6 1,14 1,52 4.568}
{0 CHEMBL1727679,6 1,14 1,37 1,52 4}
{0 CHEMBL1728483,6 1,14 1,37 1,40 1,52 4}
{0 CHEMBL1729688,14 1,52 4}
{0 CHEMBL1730304,14 1,52 5.316}
{0 CHEMBL1730460,8 1,14 1,48 1,52 4.833}
{0 CHEMBL1730959,6 1,14 1,37 1,52 4.714}
{0 CHEMBL1731009,14 1,52 5.824}
{0 CHEMBL1732016,14 1,52 6.319}
{0 CHEMBL1732183,6 1,14 1,37 1,52 4}
{0 CHEMBL1732186,14 1,52 4.002}
{0 CHEMBL1733061,14 1,52 5.896}
{0 CHEMBL1733159,6 1,14 1,52 4.315}
{0 CHEMBL1733162,6 1,14 1,16 1,37 1,52 4.171}
{0 CHEMBL1733383,14 1,46 1,52 5.176}
{0 CHEMBL1733670,6 1,14 1,37 1,52 4}
{0 CHEMBL1734906,6 1,14 1,37 1,40 1,52 4}
{0 CHEMBL1734920,14 1,52 4.002}
{0 CHEMBL1735040,11 1,14 1,44 1,52 4}
{0 CHEMBL1735408,6 1,14 1,37 1,40 1,52 4}
{0 CHEMBL1735536,8 1,52 5.83}
{0 CHEMBL1735969,6 1,14 1,37 1,52 4.328}
{0 CHEMBL1736022,6 1,14 1,15 1,37 1,52 4}
{0 CHEMBL1736524,14 1,37 1,40 1,48 1,52 4}
{0 CHEMBL1765358,7 1,14 1,52 5.745}
{0 CHEMBL177019,9 1,14 1,52 4}
{0 CHEMBL1773168,14 1,48 1,52 4.301}
{0 CHEMBL1773180,8 1,14 1,15 1,39 1,52 4.301}
{0 CHEMBL1773181,8 1,14 1,15 1,39 1,52 4.301}
{0 CHEMBL183967,14 1,28 1,52 4}
{0 CHEMBL185051,14 1,28 1,52 4.347}
{0 CHEMBL1865327,8 1,14 1,48 1,52 4.18}
{0 CHEMBL1866687,8 1,14 1,39 1,48 1,52 4.391}
{0 CHEMBL1867272,8 1,14 1,22 1,24 1,52 4.863}
{0 CHEMBL1868126,2 1,8 1,14 1,48 1,52 4.18}
{0 CHEMBL1871792,8 1,14 1,24 1,52 4.921}
{0 CHEMBL1872546,2 1,8 1,14 1,48 1,52 4.287}
{0 CHEMBL1873104,8 1,14 1,24 1,36 1,52 4.235}
{0 CHEMBL1875123,14 1,52 5.299}
{0 CHEMBL1882306,8 1,14 1,24 1,52 4.812}
{0 CHEMBL1882430,8 1,14 1,22 1,24 1,52 5.431}
{0 CHEMBL1882605,8 1,14 1,52 4.18}
{0 CHEMBL1886697,2 1,6 1,8 1,14 1,16 1,36 1,48 1,52 4.18}
{0 CHEMBL1888077,8 1,14 1,34 1,48 1,52 6.033}
{0 CHEMBL1888617,14 1,48 1,52 5.308}
{0 CHEMBL1892801,8 1,14 1,21 1,24 1,52 6.166}
{0 CHEMBL1893914,14 1,52 5.504}
{0 CHEMBL1893949,8 1,14 1,15 1,31 1,48 1,52 5.511}
{0 CHEMBL1896936,2 1,8 1,14 1,37 1,48 1,52 4.18}
{0 CHEMBL1898589,14 1,52 5.701}
{0 CHEMBL1899204,2 1,8 1,14 1,48 1,52 4.18}
{0 CHEMBL1901358,8 1,14 1,48 1,52 4.597}
{0 CHEMBL1903660,2 1,8 1,14 1,48 1,52 4.312}
{0 CHEMBL1903677,6 1,8 1,14 1,48 1,51 1,52 4.18}
{0 CHEMBL1906065,8 1,14 1,20 1,48 1,52 4.44}
{0 CHEMBL1917277,9 1,14 1,52 4}
{0 CHEMBL1917278,9 1,14 1,52 4.286}
{0 CHEMBL1917279,9 1,14 1,52 4}
{0 CHEMBL1917280,9 1,14 1,52 4}
{0 CHEMBL1917281,9 1,14 1,52 4.453}
{0 CHEMBL1917282,14 1,52 4}
{0 CHEMBL1917283,14 1,36 1,52 4}
{0 CHEMBL1917284,8 1,14 1,52 4}
{0 CHEMBL192519,8 1,14 1,15 1,28 1,39 1,40 1,52 5.412}
{0 CHEMBL1964442,8 1,14 1,52 5.81}
{0 CHEMBL1965710,8 1,14 1,52 4.851}
{0 CHEMBL1966168,5 1,8 1,14 1,41 1,52 4.79}
{0 CHEMBL1966746,8 1,14 1,52 5.517}
{0 CHEMBL1971015,14 1,37 1,52 5.278}
{0 CHEMBL1971404,2 1,8 1,14 1,17 1,43 1,52 5.866}
{0 CHEMBL1971786,8 1,14 1,37 1,48 1,52 4.664}
{0 CHEMBL1973036,14 1,36 1,37 1,52 5.121}
{0 CHEMBL1973855,2 1,14 1,17 1,37 1,52 5.18}
{0 CHEMBL1976414,14 1,37 1,48 1,52 5.514}
{0 CHEMBL1976599,14 1,48 1,52 5.623}
{0 CHEMBL1981200,8 1,14 1,52 4.599}
{0 CHEMBL1981446,14 1,52 5.502}
{0 CHEMBL1982044,14 1,21 1,37 1,52 5.64}
{0 CHEMBL1982391,8 1,14 1,52 5.469}
{0 CHEMBL1982888,8 1,14 1,28 1,40 1,52 5.386}
{0 CHEMBL1984990,8 1,14 1,15 1,31 1,52 4.807}
{0 CHEMBL1985091,14 1,37 1,52 5.298}
{0 CHEMBL1985932,14 1,37 1,52 5.32}
{0 CHEMBL1986343,2 1,14 1,48 1,52 5.914}
{0 CHEMBL1986392,8 1,14 1,37 1,52 5.056}
{0 CHEMBL1988133,8 1,14 1,52 5.178}
{0 CHEMBL1991021,14 1,37 1,52 5.733}
{0 CHEMBL1991426,8 1,14 1,37 1,48 1,52 5.542}
{0 CHEMBL1991440,14 1,37 1,48 1,52 5.387}
{0 CHEMBL1991573,8 1,14 1,19 1,28 1,40 1,52 5.474}
{0 CHEMBL1993173,8 1,14 1,37 1,52 5.611}
{0 CHEMBL1993643,8 1,14 1,31 1,52 5.37}
{0 CHEMBL1993711,14 1,37 1,48 1,52 5.411}
{0 CHEMBL1996139,8 1,14 1,48 1,52 5.547}
{0 CHEMBL1996572,8 1,14 1,52 4.893}
{0 CHEMBL1996666,14 1,52 5.714}
{0 CHEMBL2000194,9 1,14 1,37 1,49 1,52 5}
{0 CHEMBL2001743,5 1,14 1,52 5.536}
{0 CHEMBL200386,14 1,15 1,52 4}
{0 CHEMBL200475,14 1,15 1,52 4.109}
{0 CHEMBL200830,14 1,15 1,52 4}
{0 CHEMBL204337,14 1,39 1,48 1,49 1,52 5.398}
{0 CHEMBL204813,4 1,9 1,14 1,32 1,33 1,51 1,52 4.097}
{0 CHEMBL2057662,14 1,37 1,52 4}
{0 CHEMBL205924,8 1,14 1,39 1,52 4.097}
{0 CHEMBL2062528,7 1,14 1,52 5.046}
{0 CHEMBL2062590,7 1,14 1,52 4.943}
{0 CHEMBL2062591,7 1,14 1,37 1,52 5.788}
{0 CHEMBL2062592,7 1,14 1,52 5.845}
{0 CHEMBL2062593,7 1,14 1,52 5.329}
{0 CHEMBL2062594,7 1,14 1,52 4.955}
{0 CHEMBL2062595,7 1,14 1,52 5.257}
{0 CHEMBL2062596,7 1,14 1,52 5.29}
{0 CHEMBL2062597,7 1,14 1,52 5.572}
{0 CHEMBL2062598,7 1,14 1,52 5.44}
{0 CHEMBL2062599,7 1,14 1,52 5.075}
{0 CHEMBL2062707,7 1,14 1,52 5.003}
{0 CHEMBL2062708,7 1,14 1,52 5.169}
{0 CHEMBL2062709,7 1,14 1,52 4.921}
{0 CHEMBL2062710,7 1,14 1,52 4.991}
{0 CHEMBL2062711,7 1,14 1,52 5.049}
{0 CHEMBL2062712,7 1,14 1,52 4.604}
{0 CHEMBL2062713,7 1,14 1,52 5.18}
{0 CHEMBL2062714,7 1,14 1,52 5.285}
{0 CHEMBL212723,14 1,28 1,52 4.893}
{0 CHEMBL220259,14 1,39 1,52 5.465}
{0 CHEMBL2206736,9 1,14 1,49 1,52 4.921}
{0 CHEMBL2206752,14 1,52 4.12}
{0 CHEMBL2206756,14 1,52 4.48}
{0 CHEMBL227379,8 1,9 1,14 1,15 1,19 1,28 1,40 1,52 4.921}
{0 CHEMBL2311593,8 1,14 1,28 1,52 5.066}
{0 CHEMBL2316894,8 1,12 1,14 1,28 1,37 1,52 5.208}
{0 CHEMBL2316895,8 1,12 1,14 1,28 1,52 5.174}
{0 CHEMBL2316896,8 1,12 1,14 1,28 1,52 5.201}
{0 CHEMBL2316897,8 1,14 1,28 1,52 5.237}
{0 CHEMBL2316898,8 1,12 1,14 1,28 1,52 4.658}
{0 CHEMBL2316899,8 1,9 1,14 1,28 1,52 4}
{0 CHEMBL2316900,8 1,14 1,28 1,52 4}
{0 CHEMBL2316901,8 1,14 1,28 1,52 4.301}
{0 CHEMBL2316902,8 1,14 1,28 1,37 1,52 5.721}
{0 CHEMBL2316903,8 1,14 1,28 1,52 5.301}
{0 CHEMBL2316904,8 1,14 1,28 1,52 5.387}
{0 CHEMBL2316905,8 1,14 1,28 1,52 4.796}
{0 CHEMBL2316906,8 1,14 1,28 1,52 5.276}
{0 CHEMBL2316907,8 1,14 1,28 1,52 5.678}
{0 CHEMBL2316908,8 1,14 1,28 1,52 6.097}
{0 CHEMBL2316909,8 1,14 1,28 1,52 4.523}
{0 CHEMBL2316910,8 1,14 1,28 1,52 5.409}
{0 CHEMBL2349150,2 1,8 1,9 1,14 1,48 1,49 1,52 5.046}
{0 CHEMBL2349151,2 1,8 1,9 1,14 1,15 1,48 1,49 1,52 5.036}
{0 CHEMBL2349152,2 1,8 1,14 1,48 1,52 5}
{0 CHEMBL256098,14 1,28 1,37 1,48 1,52 5.606}
{0 CHEMBL267476,9 1,14 1,52 4}
{0 CHEMBL28721,14 1,52 5.492}
{0 CHEMBL292556,9 1,14 1,52 5.337}
{0 CHEMBL294317,14 1,52 4}
{0 CHEMBL294581,9 1,14 1,52 4.18}
{0 CHEMBL303581,8 1,9 1,14 1,52 4.967}
{0 CHEMBL310185,8 1,9 1,13 1,14 1,52 5}
{0 CHEMBL319845,1 1,2 1,3 1,4 1,5 1,8 1,9 1,14 1,48 1,49 1,52 4.367}
{0 CHEMBL320558,1 1,2 1,3 1,4 1,5 1,8 1,9 1,10 1,12 1,14 1,48 1,49 1,52 4.268}
{0 CHEMBL320586,1 1,2 1,3 1,4 1,5 1,8 1,9 1,14 1,48 1,49 1,52 4.328}
{0 CHEMBL320953,1 1,2 1,3 1,4 1,5 1,8 1,9 1,10 1,12 1,14 1,48 1,49 1,52 4.377}
{0 CHEMBL321179,1 1,2 1,3 1,4 1,5 1,8 1,9 1,14 1,48 1,49 1,52 4}
{0 CHEMBL321222,7 1,14 1,31 1,52 4.955}
{0 CHEMBL321386,14 1,52 4.842}
{0 CHEMBL321599,1 1,2 1,3 1,4 1,5 1,8 1,9 1,10 1,12 1,14 1,48 1,49 1,52 4.469}
{0 CHEMBL322750,1 1,2 1,3 1,4 1,5 1,8 1,9 1,14 1,48 1,49 1,52 4}
{0 CHEMBL323966,7 1,14 1,31 1,52 4.421}
{0 CHEMBL323984,7 1,14 1,52 4.839}
{0 CHEMBL323995,1 1,2 1,3 1,4 1,5 1,8 1,9 1,10 1,14 1,48 1,49 1,52 4.495}
{0 CHEMBL324181,7 1,9 1,14 1,52 4.504}
{0 CHEMBL324232,8 1,13 1,14 1,32 1,39 1,52 4.959}
{0 CHEMBL324669,1 1,2 1,3 1,4 1,5 1,8 1,9 1,10 1,12 1,14 1,48 1,49 1,52 4.658}
{0 CHEMBL325309,1 1,2 1,3 1,4 1,5 1,8 1,9 1,10 1,12 1,14 1,48 1,49 1,52 4.319}
{0 CHEMBL325564,1 1,2 1,3 1,4 1,5 1,8 1,9 1,10 1,12 1,14 1,48 1,49 1,52 4.569}
{0 CHEMBL326420,7 1,14 1,52 4.622}
{0 CHEMBL334812,5 1,7 1,8 1,13 1,14 1,23 1,52 5}
{0 CHEMBL335110,8 1,14 1,52 5}
{0 CHEMBL336095,7 1,8 1,9 1,13 1,14 1,23 1,52 5.071}
{0 CHEMBL337173,7 1,8 1,9 1,13 1,14 1,15 1,23 1,52 5.398}
{0 CHEMBL337520,7 1,8 1,9 1,13 1,14 1,15 1,52 5}
{0 CHEMBL339439,7 1,8 1,9 1,13 1,14 1,23 1,52 4.796}
{0 CHEMBL340219,5 1,7 1,8 1,13 1,14 1,23 1,52 5}
{0 CHEMBL340653,7 1,9 1,14 1,15 1,52 5.959}
{0 CHEMBL358290,14 1,48 1,52 5.499}
{0 CHEMBL360380,14 1,52 4}
{0 CHEMBL365490,8 1,14 1,39 1,52 4.799}
{0 CHEMBL365871,14 1,28 1,52 4.301}
{0 CHEMBL371922,6 1,14 1,15 1,52 4}
{0 CHEMBL372159,14 1,15 1,52 4.081}
{0 CHEMBL377360,5 1,14 1,39 1,52 4}
{0 CHEMBL377937,4 1,9 1,14 1,27 1,32 1,33 1,52 4.097}
{0 CHEMBL378806,4 1,8 1,9 1,14 1,32 1,33 1,52 4.097}
{0 CHEMBL380456,8 1,14 1,52 4.097}
{0 CHEMBL381633,8 1,14 1,15 1,52 4}
{0 CHEMBL382338,4 1,9 1,14 1,27 1,32 1,33 1,52 4.097}
{0 CHEMBL386313,14 1,52 5.68}
{0 CHEMBL409618,5 1,14 1,39 1,52 4}
{0 CHEMBL415508,7 1,14 1,31 1,48 1,52 5.328}
{0 CHEMBL419196,1 1,2 1,3 1,4 1,5 1,8 1,9 1,10 1,12 1,14 1,48 1,49 1,52 4.086}
{0 CHEMBL420292,7 1,9 1,14 1,52 4.635}
{0 CHEMBL421227,1 1,2 1,3 1,4 1,5 1,8 1,9 1,10 1,12 1,14 1,48 1,49 1,52 4.495}
{0 CHEMBL423508,7 1,14 1,31 1,52 4.907}
{0 CHEMBL427374,6 1,14 1,15 1,52 4}
{0 CHEMBL432801,1 1,2 1,3 1,4 1,5 1,8 1,9 1,10 1,12 1,14 1,48 1,49 1,52 4.699}
{0 CHEMBL435096,14 1,28 1,52 4.301}
{0 CHEMBL439324,14 1,48 1,52 4}
{0 CHEMBL440485,14 1,52 5.252}
{0 CHEMBL446577,2 1,8 1,14 1,48 1,52 4.378}
{0 CHEMBL447335,9 1,14 1,46 1,52 4.217}
{0 CHEMBL448099,7 1,8 1,9 1,14 1,15 1,52 5}
{0 CHEMBL448471,7 1,14 1,31 1,52 4.429}
{0 CHEMBL453805,8 1,9 1,14 1,49 1,52 4}
{0 CHEMBL523954,2 1,8 1,14 1,15 1,48 1,52 4.24}
{0 CHEMBL547804,9 1,14 1,15 1,48 1,52 4.192}
{0 CHEMBL565364,9 1,14 1,49 1,52 6.092}
{0 CHEMBL565369,8 1,9 1,14 1,40 1,48 1,51 1,52 5.754}
{0 CHEMBL565371,14 1,15 1,31 1,52 6.569}
{0 CHEMBL565581,8 1,14 1,28 1,40 1,52 4.79}
{0 CHEMBL565584,14 1,52 5.509}
{0 CHEMBL565595,8 1,14 1,40 1,52 5.353}
{0 CHEMBL565596,8 1,14 1,40 1,52 4.917}
{0 CHEMBL565606,8 1,9 1,14 1,40 1,52 4.799}
{0 CHEMBL565794,9 1,14 1,52 4.873}
{0 CHEMBL565795,14 1,52 7.745}
{0 CHEMBL565802,8 1,14 1,40 1,52 5.73}
{0 CHEMBL565810,14 1,52 7.108}
{0 CHEMBL566634,7 1,8 1,14 1,19 1,40 1,52 5.496}
{0 CHEMBL566855,14 1,52 5.457}
{0 CHEMBL567047,8 1,14 1,48 1,52 5.532}
{0 CHEMBL567069,14 1,52 7.149}
{0 CHEMBL567473,14 1,52 5.745}
{0 CHEMBL567686,14 1,52 4.86}
{0 CHEMBL57013,3 1,7 1,8 1,13 1,14 1,23 1,39 1,52 5.292}
{0 CHEMBL570174,8 1,9 1,14 1,15 1,40 1,52 4.801}
{0 CHEMBL570345,8 1,14 1,52 5.126}
{0 CHEMBL570408,14 1,52 5.513}
{0 CHEMBL577311,2 1,14 1,17 1,52 5.578}
{0 CHEMBL578512,14 1,20 1,52 5.866}
{0 CHEMBL584481,14 1,52 7.131}
{0 CHEMBL584887,14 1,15 1,31 1,52 5.62}
{0 CHEMBL585093,14 1,52 5.745}
{0 CHEMBL585291,8 1,14 1,40 1,52 5.504}
{0 CHEMBL585314,9 1,14 1,16 1,39 1,49 1,52 5.697}
{0 CHEMBL585473,8 1,14 1,19 1,28 1,52 4.86}
{0 CHEMBL590043,14 1,21 1,28 1,48 1,52 4.301}
{0 CHEMBL592943,8 1,14 1,15 1,39 1,52 4.688}
{0 CHEMBL59678,14 1,39 1,52 4}
{0 CHEMBL59794,9 1,14 1,52 4.211}
{0 CHEMBL59929,8 1,14 1,39 1,52 4}
{0 CHEMBL599924,9 1,14 1,20 1,49 1,52 5.65}
{0 CHEMBL60072,8 1,9 1,14 1,52 5.328}
{0 CHEMBL601167,14 1,37 1,52 5.604}
{0 CHEMBL60297,8 1,9 1,14 1,52 5.102}
{0 CHEMBL61058,9 1,14 1,20 1,52 4.214}
{0 CHEMBL61121,9 1,14 1,52 4.552}
{0 CHEMBL61909,14 1,52 5.066}
{0 CHEMBL62224,9 1,14 1,39 1,52 4.553}
{0 CHEMBL6246,14 1,52 5.91}
{0 CHEMBL64045,9 1,14 1,52 4.347}
{0 CHEMBL64500,14 1,48 1,52 4}
{0 CHEMBL64626,9 1,14 1,52 4.328}
{0 CHEMBL64690,9 1,14 1,52 4.593}
{0 CHEMBL66953,7 1,9 1,14 1,42 1,49 1,52 5.91}
