{
  "data_set_description": {
    "collection_date": "November 2013",
    "creator": "Dr Jeremy Besnard, Dr Ivan Olier, Dr Noureddin Sadawi, Dr Larisa Soldatova, Dr Crina Grosan, Prof Ross King, Dr Richard Bickerton, Prof Andrew Hopkins and Dr Willem van Hoorn",
    "default_target_attribute": "pXC50",
    "description": "This dataset contains QSAR data (from ChEMBL version 17) showing activity values (unit is pseudo-pCI50) of several compounds on drug target ChEMBL_ID: CHEMBL4081 (TID: 11092), and it has 76 rows and 1243 features (not including molecule IDs and class feature: molecule_id and pXC50). The features represent Molecular Descriptors which were generated from SMILES strings. Missing value imputation was applied to this dataset (By choosing the Median).",
    "description_version": "1",
    "file_id": "3626726",
    "format": "ARFF",
    "id": "38005",
    "licence": "Public",
    "md5_checksum": "bc2f8c52ab4dccae585b3d7ca0bef61c",
    "minio_url": "https://data.openml.org/datasets/0003/38005/dataset_38005.pq",
    "name": "QSAR-DATASET-FOR-DRUG-TARGET-CHEMBL4081",
    "original_data_url": "https://www.ebi.ac.uk/chembl/target/inspect/CHEMBL4081",
    "parquet_url": "https://data.openml.org/datasets/0003/38005/dataset_38005.pq",
    "processing_date": "2018-10-04 05:41:01",
    "row_id_attribute": "molecule_id",
    "status": "deactivated",
    "tag": [
      "MetaQSAR",
      "study_13"
    ],
    "upload_date": "2016-07-16T02:36:48",
    "url": "https://api.openml.org/data/v1/download/3626726/QSAR-DATASET-FOR-DRUG-TARGET-CHEMBL4081.arff",
    "version": "12",
    "visibility": "public"
  }
}