"molecule_id","MW","nBO","nBT","nC","nSK","Sp","pXC50"
{1 219.32,2 15,3 36,4 10,5 15,6 20.438,7 5.624}
{0 CHEMBL1076191,1 205.24,2 15,3 30,4 8,5 14,6 16.608,7 5.509}
{0 CHEMBL108084,1 147.2,2 10,3 23,4 6,5 10,6 12.938,7 4.385}
{0 CHEMBL1082047,1 205.24,2 15,3 30,4 8,5 14,6 16.608,7 5.745}
{0 CHEMBL1088892,1 219.32,2 15,3 36,4 10,5 15,6 20.438,7 5.42}
{0 CHEMBL1090539,1 247.38,2 17,3 42,4 12,5 17,6 23.961,7 5.62}
{0 CHEMBL1093264,1 425.51,2 26,3 51,4 12,5 26,6 30.267,7 5.363}
{0 CHEMBL120007,1 353.59,2 25,3 56,4 18,5 24,6 35.302,7 7.577}
{0 CHEMBL120169,1 249.43,2 16,3 39,4 10,5 16,6 24.256,7 5.481}
{0 CHEMBL120226,1 337.54,2 24,3 51,4 17,5 23,6 32.779,7 7.301}
{0 CHEMBL120395,1 317.56,2 21,3 52,4 15,5 21,6 32.302,7 6.409}
{0 CHEMBL120488,1 339.56,2 24,3 53,4 17,5 23,6 33.54,7 7.67}
{0 CHEMBL120489,1 305.55,2 20,3 51,4 14,5 20,6 31.302,7 7.639}
{0 CHEMBL1208974,1 335.42,2 20,3 39,4 9,5 20,6 23.619,7 5.705}
{0 CHEMBL1209027,1 305.39,2 18,3 35,4 8,5 18,6 21.403,7 4.824}
{0 CHEMBL121223,1 325.53,2 23,3 50,4 16,5 22,6 31.779,7 4.939}
{0 CHEMBL121283,1 277.49,2 18,3 45,4 12,5 18,6 27.779,7 8.097}
{0 CHEMBL1224887,1 906.98,2 79,3 121,4 56,5 68,6 77.443,7 4.026}
{0 CHEMBL1232371,1 345.44,2 22,3 47,4 12,5 22,6 27.256,7 5.546}
{0 CHEMBL1258528,1 395.48,2 24,3 47,4 11,5 24,6 28.051,7 4}
{0 CHEMBL1258529,1 315.41,2 20,3 43,4 11,5 20,6 25.04,7 5.854}
{0 CHEMBL1258643,1 315.41,2 20,3 43,4 11,5 20,6 25.04,7 5.538}
{0 CHEMBL1561,1 207.26,2 14,3 31,4 8,5 14,6 17.369,7 6.48}
{0 CHEMBL1566,1 645.69,2 47,3 90,4 25,5 44,6 50.176,7 5.699}
{0 CHEMBL1641739,1 189.29,2 13,3 32,4 9,5 13,6 18.222,7 5.328}
{0 CHEMBL1641741,1 203.32,2 14,3 35,4 10,5 14,6 19.983,7 4.745}
{0 CHEMBL1641742,1 217.35,2 15,3 38,4 11,5 15,6 21.745,7 4.959}
{0 CHEMBL1641743,1 231.38,2 16,3 41,4 12,5 16,6 23.506,7 4.796}
{0 CHEMBL1641744,1 245.41,2 17,3 44,4 13,5 17,6 25.267,7 4.125}
{0 CHEMBL1641746,1 259.44,2 18,3 47,4 14,5 18,6 27.029,7 5.854}
{0 CHEMBL1641747,1 273.47,2 19,3 50,4 15,5 19,6 28.79,7 5.77}
{0 CHEMBL1641748,1 287.5,2 20,3 53,4 16,5 20,6 30.552,7 4.886}
{0 CHEMBL1641749,1 245.41,2 17,3 44,4 13,5 17,6 25.267,7 5.056}
{0 CHEMBL1645620,1 161.23,2 11,3 26,4 7,5 11,6 14.699,7 4.959}
{0 CHEMBL1645621,1 175.26,2 12,3 29,4 8,5 12,6 16.46,7 4.328}
{0 CHEMBL1684162,1 255.35,2 16,3 35,4 9,5 16,6 20.608,7 5.886}
{0 CHEMBL1684163,1 225.32,2 14,3 31,4 8,5 14,6 18.392,7 4.046}
{0 CHEMBL1684165,1 225.32,2 14,3 31,4 8,5 14,6 18.392,7 4.277}
{0 CHEMBL1684166,1 315.41,2 20,3 43,4 11,5 20,6 25.04,7 6.262}
{0 CHEMBL1765289,1 425.51,2 26,3 51,4 12,5 26,6 30.267,7 4.796}
{0 CHEMBL1765290,1 425.51,2 26,3 51,4 12,5 26,6 30.267,7 5.071}
{0 CHEMBL1765343,1 425.51,2 26,3 51,4 12,5 26,6 30.267,7 4.62}
{0 CHEMBL1765344,1 425.51,2 26,3 51,4 12,5 26,6 30.267,7 5.046}
{0 CHEMBL1770625,1 269.38,2 17,3 38,4 10,5 17,6 22.369,7 6.373}
{0 CHEMBL1770626,1 283.41,2 18,3 41,4 11,5 18,6 24.131,7 6.745}
{0 CHEMBL1770627,1 437.74,2 29,3 74,4 22,5 29,6 43.506,7 5.886}
{0 CHEMBL1770628,1 345.48,2 24,3 49,4 16,5 23,6 29.892,7 6.675}
{0 CHEMBL184028,1 289.47,2 20,3 51,4 15,5 20,6 29.245,7 5.5}
{0 CHEMBL186068,1 275.44,2 19,3 48,4 14,5 19,6 27.483,7 6.367}
{0 CHEMBL186150,1 247.38,2 17,3 42,4 12,5 17,6 23.961,7 6.347}
{0 CHEMBL186291,1 275.44,2 19,3 48,4 14,5 19,6 27.483,7 5.773}
{0 CHEMBL187158,1 289.47,2 20,3 51,4 15,5 20,6 29.245,7 6.409}
{0 CHEMBL187208,1 205.29,2 14,3 33,4 9,5 14,6 18.676,7 4.388}
{0 CHEMBL1939276,1 906.98,2 79,3 121,4 56,5 68,6 77.443,7 4.046}
{0 CHEMBL1939278,1 906.98,2 79,3 121,4 56,5 68,6 77.443,7 4.013}
{0 CHEMBL1939428,1 680.74,2 59,3 91,4 42,5 51,6 58.273,7 4.051}
{0 CHEMBL2159631,1 425.51,2 26,3 51,4 12,5 26,6 30.267,7 4.959}
{0 CHEMBL2159632,1 425.51,2 26,3 51,4 12,5 26,6 30.267,7 4.495}
{0 CHEMBL2159633,1 425.51,2 26,3 51,4 12,5 26,6 30.267,7 4.796}
{0 CHEMBL2159634,1 425.51,2 26,3 51,4 12,5 26,6 30.267,7 4.796}
{0 CHEMBL2159635,1 425.51,2 26,3 51,4 12,5 26,6 30.267,7 4.699}
{0 CHEMBL2159636,1 425.51,2 26,3 51,4 12,5 26,6 30.267,7 4.678}
{0 CHEMBL2159637,1 425.51,2 26,3 51,4 12,5 26,6 30.267,7 4.249}
{0 CHEMBL2159763,1 425.51,2 26,3 51,4 12,5 26,6 30.267,7 4.174}
{0 CHEMBL2177689,1 147.2,2 10,3 23,4 6,5 10,6 12.938,7 6.18}
{0 CHEMBL2177690,1 265.39,2 20,3 43,4 15,5 19,6 25.745,7 4.854}
{0 CHEMBL2177691,1 217.35,2 15,3 38,4 11,5 15,6 21.745,7 4.921}
{0 CHEMBL2177692,1 205.29,2 14,3 33,4 9,5 14,6 18.676,7 4.018}
{0 CHEMBL2177693,1 205.29,2 14,3 33,4 9,5 14,6 18.676,7 5.244}
{0 CHEMBL2177695,1 275.44,2 19,3 48,4 14,5 19,6 27.483,7 5.824}
{0 CHEMBL2177696,1 189.29,2 13,3 32,4 9,5 13,6 18.222,7 4.203}
{0 CHEMBL222396,1 193.23,2 13,3 28,4 7,5 13,6 15.608,7 5.678}
{0 CHEMBL247666,1 177.23,2 12,3 27,4 7,5 12,6 15.153,7 4.116}
{0 CHEMBL259721,1 255.35,2 16,3 35,4 9,5 16,6 20.608,7 5.142}
{0 CHEMBL261634,1 133.17,2 9,3 20,4 5,5 9,6 11.176,7 4.396}
{0 CHEMBL268675,1 269.27,2 22,3 33,4 15,5 20,6 21.631,7 5.62}
{0 CHEMBL307429,1 163.2,2 11,3 24,4 6,5 11,6 13.392,7 6.484}
{0 CHEMBL310231,1 177.23,2 12,3 27,4 7,5 12,6 15.153,7 4.301}
{0 CHEMBL312653,1 163.2,2 11,3 24,4 6,5 11,6 13.392,7 4.12}
{0 CHEMBL323803,1 325.53,2 23,3 50,4 16,5 22,6 31.779,7 5.235}
{0 CHEMBL330763,1 277.49,2 18,3 45,4 12,5 18,6 27.779,7 5.155}
{0 CHEMBL331723,1 289.5,2 19,3 46,4 13,5 19,6 28.779,7 6.658}
{0 CHEMBL332468,1 275.47,2 18,3 43,4 12,5 18,6 27.017,7 6.325}
{0 CHEMBL332802,1 325.53,2 23,3 50,4 16,5 22,6 31.779,7 6.081}
{0 CHEMBL333917,1 311.5,2 22,3 47,4 15,5 21,6 30.017,7 5.456}
{0 CHEMBL362754,1 205.29,2 14,3 33,4 9,5 14,6 18.676,7 5.699}
{0 CHEMBL364554,1 247.38,2 17,3 42,4 12,5 17,6 23.961,7 5.689}
{0 CHEMBL365496,1 219.32,2 15,3 36,4 10,5 15,6 20.438,7 4.921}
{0 CHEMBL369297,1 163.2,2 11,3 24,4 6,5 11,6 13.392,7 4.649}
{0 CHEMBL402196,1 167.18,2 12,3 21,4 8,5 12,6 13.415,7 5.444}
{0 CHEMBL403239,1 125.14,2 9,3 16,4 6,5 9,6 10.199,7 5.377}
{0 CHEMBL405957,1 163.2,2 11,3 24,4 6,5 11,6 13.392,7 6.161}
{0 CHEMBL406973,1 133.17,2 9,3 20,4 5,5 9,6 11.176,7 5.828}
{0 CHEMBL407337,1 177.23,2 12,3 27,4 7,5 12,6 15.153,7 4.959}
{0 CHEMBL415713,1 291.52,2 19,3 48,4 13,5 19,6 29.54,7 7.597}
{0 CHEMBL432221,1 275.47,2 18,3 43,4 12,5 18,6 27.017,7 7}
{0 CHEMBL456583,1 147.2,2 10,3 23,4 6,5 10,6 12.938,7 5.222}
{0 CHEMBL460255,1 344.43,2 22,3 46,4 12,5 22,6 26.875,7 7.144}
{0 CHEMBL476960,1 267.32,2 18,3 39,4 10,5 18,6 21.801,7 5.678}
{0 CHEMBL478209,1 355.39,2 25,3 50,4 13,5 24,6 27.688,7 5.585}
{0 CHEMBL499404,1 1529.87,2 117,3 233,4 71,5 106,6 131.069,7 4.225}
{0 CHEMBL501355,1 193.23,2 13,3 28,4 7,5 13,6 15.608,7 6.463}
{0 CHEMBL501385,1 147.2,2 10,3 23,4 6,5 10,6 12.938,7 4.469}
{0 CHEMBL504167,1 680.74,2 59,3 91,4 42,5 51,6 58.273,7 4.254}
{0 CHEMBL507403,1 1545.87,2 118,3 234,4 71,5 107,6 131.523,7 4.339}
{0 CHEMBL75971,1 177.23,2 12,3 27,4 7,5 12,6 15.153,7 7.549}
{0 CHEMBL77918,1 219.32,2 15,3 36,4 10,5 15,6 20.438,7 4.301}
{0 CHEMBL80148,1 147.2,2 10,3 23,4 6,5 10,6 12.938,7 4.078}
{0 CHEMBL80254,1 133.17,2 9,3 20,4 5,5 9,6 11.176,7 4.528}
{0 CHEMBL8260,1 270.25,2 22,3 32,4 15,5 20,6 21.08,7 4.284}
