{
  "data_features": {
    "feature": [
      {
        "data_type": "nominal",
        "index": "0",
        "is_ignore": "false",
        "is_row_identifier": "true",
        "is_target": "false",
        "name": "molecule_id",
        "nominal_value": [
          "CHEMBL1643951",
          "CHEMBL1643952",
          "CHEMBL1643953",
          "CHEMBL1643954",
          "CHEMBL1643955",
          "CHEMBL1644173",
          "CHEMBL1644174",
          "CHEMBL1644175",
          "CHEMBL1644176",
          "CHEMBL1644178",
          "CHEMBL1644182",
          "CHEMBL1644183",
          "CHEMBL1644184",
          "CHEMBL1644185",
          "CHEMBL1644186",
          "CHEMBL1644188",
          "CHEMBL1922834",
          "CHEMBL1922835",
          "CHEMBL1922839",
          "CHEMBL1922840",
          "CHEMBL1922841",
          "CHEMBL1922842",
          "CHEMBL1922933",
          "CHEMBL1933349",
          "CHEMBL1933360",
          "CHEMBL1933363",
          "CHEMBL1933364",
          "CHEMBL1933365",
          "CHEMBL198387",
          "CHEMBL198736",
          "CHEMBL2159327",
          "CHEMBL2159328",
          "CHEMBL2159330",
          "CHEMBL2159331",
          "CHEMBL2159335",
          "CHEMBL2159337",
          "CHEMBL2159338",
          "CHEMBL2159339",
          "CHEMBL2159340",
          "CHEMBL2159341",
          "CHEMBL2159342",
          "CHEMBL2159343",
          "CHEMBL2159347",
          "CHEMBL2159348",
          "CHEMBL2159349",
          "CHEMBL2159350",
          "CHEMBL2159351",
          "CHEMBL2159352",
          "CHEMBL2159353",
          "CHEMBL219384",
          "CHEMBL232037",
          "CHEMBL232224",
          "CHEMBL232239",
          "CHEMBL232241",
          "CHEMBL232242",
          "CHEMBL232448",
          "CHEMBL234087",
          "CHEMBL375167",
          "CHEMBL386446",
          "CHEMBL395759",
          "CHEMBL396215",
          "CHEMBL398180",
          "CHEMBL407028",
          "CHEMBL411831",
          "CHEMBL411832",
          "CHEMBL411833",
          "CHEMBL430163",
          "CHEMBL442651",
          "CHEMBL443971",
          "CHEMBL444126",
          "CHEMBL445532",
          "CHEMBL446821",
          "CHEMBL447684",
          "CHEMBL447742",
          "CHEMBL448561",
          "CHEMBL448584",
          "CHEMBL450411",
          "CHEMBL451288",
          "CHEMBL452067",
          "CHEMBL452310",
          "CHEMBL452311",
          "CHEMBL452451",
          "CHEMBL453457",
          "CHEMBL455214",
          "CHEMBL455323",
          "CHEMBL456738",
          "CHEMBL464663",
          "CHEMBL470729",
          "CHEMBL471580",
          "CHEMBL472586",
          "CHEMBL486634",
          "CHEMBL486650",
          "CHEMBL486651",
          "CHEMBL487476",
          "CHEMBL487662",
          "CHEMBL487668",
          "CHEMBL491352",
          "CHEMBL491920",
          "CHEMBL492605",
          "CHEMBL492813",
          "CHEMBL493019",
          "CHEMBL493020",
          "CHEMBL493233",
          "CHEMBL494248",
          "CHEMBL499160",
          "CHEMBL501392",
          "CHEMBL501628",
          "CHEMBL502694",
          "CHEMBL504156",
          "CHEMBL504245",
          "CHEMBL504260",
          "CHEMBL505685",
          "CHEMBL506800",
          "CHEMBL509710",
          "CHEMBL519776",
          "CHEMBL519903",
          "CHEMBL520893",
          "CHEMBL521650",
          "CHEMBL523847",
          "CHEMBL528775",
          "CHEMBL577345",
          "CHEMBL62444"
        ],
        "number_of_missing_values": "0"
      },
      {
        "data_type": "numeric",
        "index": "1",
        "is_ignore": "false",
        "is_row_identifier": "false",
        "is_target": "false",
        "name": "Sp",
        "number_of_missing_values": "0"
      },
      {
        "data_type": "numeric",
        "index": "2",
        "is_ignore": "false",
        "is_row_identifier": "false",
        "is_target": "false",
        "name": "nBM",
        "number_of_missing_values": "0"
      },
      {
        "data_type": "numeric",
        "index": "3",
        "is_ignore": "false",
        "is_row_identifier": "false",
        "is_target": "false",
        "name": "Sv",
        "number_of_missing_values": "0"
      },
      {
        "data_type": "numeric",
        "index": "4",
        "is_ignore": "false",
        "is_row_identifier": "false",
        "is_target": "false",
        "name": "nAB",
        "number_of_missing_values": "0"
      },
      {
        "data_type": "numeric",
        "index": "5",
        "is_ignore": "false",
        "is_row_identifier": "false",
        "is_target": "true",
        "name": "pXC50",
        "number_of_missing_values": "0"
      }
    ]
  }
}