"molecule_id","AMW","C.","H.","Me","Mi","Mp","Mv","MW","N.","nAB","nAT","nB","nBM","nBO","nBR","nBT","nC","nCL","nCsp","nCsp2","nCsp3","nDB","nF","nH","nHet","nHM","nI","nN","nO","nP","nS","nSK","nTB","nX","O.","RBF","RBN","SCBO","Se","Si","Sp","Sv","X.","pXC50"
{1 9.211,2 44.1,3 41.2,4 1.021,5 1.113,6 0.711,7 0.677,8 313.19,10 6,11 34,13 8,14 22,16 36,17 15,18 2,20 9,21 6,22 2,24 14,25 5,26 2,29 3,32 20,34 2,35 8.8,36 0.083,37 3,38 27,39 34.698,40 37.838,41 24.171,42 23.014,43 5.9,44 8}
{0 CHEMBL186242,1 9.684,2 44.1,3 41.2,4 1.013,5 1.104,6 0.746,7 0.691,8 329.26,10 6,11 34,13 8,14 22,16 36,17 15,18 2,20 9,21 6,22 2,24 14,25 5,26 3,29 2,31 1,32 20,34 2,35 5.9,36 0.083,37 3,38 27,39 34.447,40 37.548,41 25.364,42 23.486,43 5.9,44 8.347}
{0 CHEMBL186447,1 8.671,2 44.1,3 44.1,4 1.004,5 1.106,6 0.721,7 0.666,8 294.82,10 6,11 34,13 8,14 21,16 36,17 15,18 1,20 9,21 6,22 2,24 15,25 4,26 2,29 2,31 1,32 19,34 1,35 5.9,36 0.083,37 3,38 26,39 34.124,40 37.604,41 24.506,42 22.659,43 2.9,44 7.886}
{0 CHEMBL186501,1 7.658,2 44.1,3 47.1,4 0.994,5 1.108,6 0.696,7 0.642,8 260.38,10 6,11 34,13 8,14 20,16 36,17 15,20 9,21 6,22 2,24 16,25 3,26 1,29 2,31 1,32 18,35 5.9,36 0.083,37 3,38 25,39 33.8,40 37.66,41 23.648,42 21.831,44 6.041}
{0 CHEMBL187695,1 9.979,2 44.1,3 44.1,4 1.001,5 1.103,6 0.735,7 0.672,8 339.27,10 6,11 34,13 8,14 21,15 1,16 36,17 15,20 9,21 6,22 2,24 15,25 4,26 2,29 2,31 1,32 19,34 1,35 5.9,36 0.083,37 3,38 26,39 34.029,40 37.502,41 25,42 22.856,43 2.9,44 8.041}
{0 CHEMBL224018,1 8.497,2 40.5,3 43.2,4 1.028,5 1.134,6 0.669,7 0.644,8 314.38,10 6,11 37,13 8,14 23,16 39,17 15,20 7,21 8,22 2,23 2,24 16,25 6,26 1,29 3,31 1,32 21,34 2,35 8.1,36 0.077,37 3,38 28,39 38.036,40 41.964,41 24.739,42 23.839,43 5.4,44 7.051}
{0 CHEMBL226974,1 8.756,2 41.7,3 44.4,4 1.016,5 1.118,6 0.693,7 0.654,8 315.21,10 6,11 36,13 7,14 22,16 38,17 15,18 2,20 7,21 8,22 1,24 16,25 5,26 2,29 3,32 20,34 2,35 8.3,36 0.079,37 3,38 26,39 36.582,40 40.253,41 24.932,42 23.541,43 5.6,44 7.252}
{0 CHEMBL227438,1 10.786,2 41.7,3 47.2,4 0.993,5 1.105,6 0.752,7 0.658,8 388.29,10 6,11 36,13 7,14 21,16 38,17 15,20 7,21 8,22 1,24 17,25 4,26 2,27 1,29 2,31 1,32 19,34 1,35 5.6,36 0.079,37 3,38 25,39 35.753,40 39.796,41 27.068,42 23.675,43 2.8,44 8.046}
{0 CHEMBL227470,1 8.716,2 44.1,3 41.2,4 1.024,5 1.128,6 0.692,7 0.665,8 296.36,10 6,11 34,13 8,14 22,16 36,17 15,20 9,21 6,22 2,23 2,24 14,25 5,26 1,29 2,31 1,32 20,34 2,35 5.9,36 0.083,37 3,38 27,39 34.825,40 38.34,41 23.523,42 22.598,43 5.9,44 7.125}
{0 CHEMBL227526,1 8.756,2 41.7,3 44.4,4 1.016,5 1.118,6 0.693,7 0.654,8 315.21,10 6,11 36,13 7,14 22,16 38,17 15,18 2,20 7,21 8,22 1,24 16,25 5,26 2,29 3,32 20,34 2,35 8.3,36 0.079,37 3,38 26,39 36.582,40 40.253,41 24.932,42 23.541,43 5.6,44 8.481}
{0 CHEMBL227537,1 9.656,2 40.5,3 45.9,4 1.006,5 1.112,6 0.709,7 0.651,8 357.29,10 6,11 37,13 8,14 22,15 1,16 39,17 15,20 7,21 8,22 2,24 17,25 5,26 2,29 3,31 1,32 20,34 1,35 8.1,36 0.077,37 3,38 27,39 37.24,40 41.127,41 26.216,42 24.098,43 2.7,44 7.854}
{0 CHEMBL227538,1 8.206,2 40,3 47.5,4 1.006,5 1.124,6 0.681,7 0.634,8 328.26,9 2.5,10 6,11 40,13 7,14 23,16 42,17 16,18 2,20 7,21 9,22 1,24 19,25 5,26 2,28 1,29 2,32 21,34 2,35 5,36 0.071,37 3,38 27,39 40.24,40 44.957,41 27.245,42 25.374,43 5,44 9.398}
{0 CHEMBL227578,1 8.775,2 41,3 43.6,4 1.018,5 1.122,6 0.691,7 0.655,8 342.24,9 2.6,10 6,11 39,13 8,14 24,16 41,17 16,18 2,20 9,21 7,22 2,24 17,25 6,26 2,28 1,29 3,32 22,34 2,35 7.7,36 0.073,37 3,38 29,39 39.684,40 43.751,41 26.938,42 25.562,43 5.1,44 6.577}
{0 CHEMBL227580,1 8.246,2 41.7,3 47.2,4 1,5 1.112,6 0.702,7 0.644,8 296.84,10 6,11 36,13 7,14 21,16 38,17 15,18 1,20 7,21 8,22 1,24 17,25 4,26 2,29 2,31 1,32 19,34 1,35 5.6,36 0.079,37 3,38 25,39 36.007,40 40.02,41 25.267,42 23.185,43 2.8,44 8.018}
{0 CHEMBL227629,1 8.246,2 41.7,3 47.2,4 1,5 1.112,6 0.702,7 0.644,8 296.84,10 6,11 36,13 7,14 21,16 38,17 15,18 1,20 7,21 8,22 1,24 17,25 4,26 2,29 2,31 1,32 19,34 1,35 5.6,36 0.079,37 3,38 25,39 36.007,40 40.02,41 25.267,42 23.185,43 2.8,44 7.959}
{0 CHEMBL227632,1 8.397,2 39,3 46.3,4 1.014,5 1.126,6 0.676,7 0.636,8 344.26,9 2.4,10 6,11 41,13 7,14 24,16 43,17 16,18 2,20 7,21 9,22 1,24 19,25 6,26 2,28 1,29 3,32 22,34 2,35 7.3,36 0.07,37 3,38 28,39 41.567,40 46.167,41 27.699,42 26.089,43 4.9,44 6.317}
{0 CHEMBL227654,1 9.211,2 44.1,3 41.2,4 1.021,5 1.113,6 0.711,7 0.677,8 313.19,10 6,11 34,13 8,14 22,16 36,17 15,18 2,20 9,21 6,22 2,24 14,25 5,26 2,29 3,32 20,34 2,35 8.8,36 0.083,37 3,38 27,39 34.698,40 37.838,41 24.171,42 23.014,43 5.9,44 8.337}
{0 CHEMBL227658,1 8.288,2 41.7,3 44.4,4 1.02,5 1.132,6 0.675,7 0.642,8 298.38,10 6,11 36,13 7,14 22,16 38,17 15,20 7,21 8,22 1,23 2,24 16,25 5,26 1,29 2,31 1,32 20,34 2,35 5.6,36 0.079,37 3,38 26,39 36.709,40 40.755,41 24.284,42 23.125,43 5.6,44 7.947}
{0 CHEMBL227662,1 9.202,2 41.7,3 44.4,4 1.009,5 1.11,6 0.726,7 0.667,8 331.28,10 6,11 36,13 7,14 22,16 38,17 15,18 2,20 7,21 8,22 1,24 16,25 5,26 3,29 2,31 1,32 20,34 2,35 5.6,36 0.079,37 3,38 26,39 36.331,40 39.964,41 26.125,42 24.013,43 5.6,44 8.31}
{0 CHEMBL227714,1 7.44,2 45.2,3 47.6,4 0.99,5 1.107,6 0.695,7 0.64,8 312.46,10 11,11 42,13 12,14 25,16 45,17 19,20 11,21 8,22 1,24 20,25 3,26 1,29 2,31 1,32 22,35 4.8,36 0.067,37 3,38 31.5,39 41.567,40 46.491,41 29.171,42 26.885,44 8.097}
{0 CHEMBL227720,1 8.745,2 41.7,3 44.4,4 1.014,5 1.121,6 0.7,7 0.655,8 314.83,10 6,11 36,13 7,14 22,16 38,17 15,18 1,20 7,21 8,22 1,23 1,24 16,25 5,26 2,29 2,31 1,32 20,34 2,35 5.6,36 0.079,37 3,38 26,39 36.52,40 40.359,41 25.205,42 23.569,43 5.6,44 8.222}
{0 CHEMBL227757,1 9.202,2 41.7,3 44.4,4 1.009,5 1.11,6 0.726,7 0.667,8 331.28,10 6,11 36,13 7,14 22,16 38,17 15,18 2,20 7,21 8,22 1,24 16,25 5,26 3,29 2,31 1,32 20,34 2,35 5.6,36 0.079,37 3,38 26,39 36.331,40 39.964,41 26.125,42 24.013,43 5.6,44 8.244}
{0 CHEMBL227773,1 8.397,2 39,3 46.3,4 1.014,5 1.126,6 0.676,7 0.636,8 344.26,9 2.4,10 6,11 41,13 7,14 24,16 43,17 16,18 2,20 7,21 9,22 1,24 19,25 6,26 2,28 1,29 3,32 22,34 2,35 7.3,36 0.07,37 3,38 28,39 41.567,40 46.167,41 27.699,42 26.089,43 4.9,44 9.523}
{0 CHEMBL227787,1 8.941,2 40.5,3 43.2,4 1.023,5 1.123,6 0.693,7 0.656,8 330.83,10 6,11 37,13 8,14 23,16 39,17 15,18 1,20 7,21 8,22 2,23 1,24 16,25 6,26 2,29 3,31 1,32 21,34 2,35 8.1,36 0.077,37 3,38 28,39 37.847,40 41.569,41 25.659,42 24.284,43 5.4,44 7.854}
{0 CHEMBL227788,1 9.684,2 44.1,3 41.2,4 1.013,5 1.104,6 0.746,7 0.691,8 329.26,10 6,11 34,13 8,14 22,16 36,17 15,18 2,20 9,21 6,22 2,24 14,25 5,26 3,29 2,31 1,32 20,34 2,35 5.9,36 0.083,37 3,38 27,39 34.447,40 37.548,41 25.364,42 23.486,43 5.9,44 8.602}
{0 CHEMBL227829,1 9.202,2 41.7,3 44.4,4 1.009,5 1.11,6 0.726,7 0.667,8 331.28,10 6,11 36,13 7,14 22,16 38,17 15,18 2,20 7,21 8,22 1,24 16,25 5,26 3,29 2,31 1,32 20,34 2,35 5.6,36 0.079,37 3,38 26,39 36.331,40 39.964,41 26.125,42 24.013,43 5.6,44 8.699}
{0 CHEMBL227878,1 7.524,2 40.5,3 48.6,4 1,5 1.116,6 0.672,7 0.624,8 278.4,10 6,11 37,13 8,14 21,16 39,17 15,20 7,21 8,22 2,24 18,25 4,26 1,29 3,31 1,32 19,35 8.1,36 0.077,37 3,38 26,39 37.011,40 41.285,41 24.864,42 23.073,44 6}
{0 CHEMBL228038,1 7.289,2 41.7,3 50,4 0.991,5 1.113,6 0.678,7 0.621,8 262.4,10 6,11 36,13 7,14 20,16 38,17 15,20 7,21 8,22 1,24 18,25 3,26 1,29 2,31 1,32 18,35 5.6,36 0.079,37 3,38 24,39 35.683,40 40.076,41 24.409,42 22.358,44 6.932}
{0 CHEMBL228092,1 7.289,2 41.7,3 50,4 0.991,5 1.113,6 0.678,7 0.621,8 262.4,10 6,11 36,13 7,14 20,16 38,17 15,20 7,21 8,22 1,24 18,25 3,26 1,29 2,31 1,32 18,35 5.6,36 0.079,37 3,38 24,39 35.683,40 40.076,41 24.409,42 22.358,44 6.854}
{0 CHEMBL228096,1 8.243,2 42.1,3 47.4,4 1.004,5 1.117,6 0.69,7 0.641,8 313.24,10 6,11 38,13 7,14 22,16 40,17 16,18 2,20 7,21 9,22 1,24 18,25 4,26 2,29 2,32 20,34 2,35 5.3,36 0.075,37 3,38 26,39 38.138,40 42.459,41 26.239,42 24.353,43 5.3,44 7.886}
{0 CHEMBL228104,1 8.206,2 40,3 47.5,4 1.006,5 1.124,6 0.681,7 0.634,8 328.26,9 2.5,10 6,11 40,13 7,14 23,16 42,17 16,18 2,20 7,21 9,22 1,24 19,25 5,26 2,28 1,29 2,32 21,34 2,35 5,36 0.071,37 3,38 27,39 40.24,40 44.957,41 27.245,42 25.374,43 5,44 8.959}
{0 CHEMBL228156,1 9.386,2 40.5,3 43.2,4 1.018,5 1.113,6 0.718,7 0.668,8 347.28,10 6,11 37,13 8,14 23,16 39,17 15,18 2,20 7,21 8,22 2,24 16,25 6,26 3,29 3,31 1,32 21,34 2,35 8.1,36 0.077,37 3,38 28,39 37.658,40 41.173,41 26.58,42 24.728,43 5.4,44 8.276}
{0 CHEMBL228158,1 8.941,2 40.5,3 43.2,4 1.023,5 1.123,6 0.693,7 0.656,8 330.83,10 6,11 37,13 8,14 23,16 39,17 15,18 1,20 7,21 8,22 2,23 1,24 16,25 6,26 2,29 3,31 1,32 21,34 2,35 8.1,36 0.077,37 3,38 28,39 37.847,40 41.569,41 25.659,42 24.284,43 5.4,44 7.638}
{0 CHEMBL322923,1 8.645,2 44.4,3 44.4,4 1.007,5 1.112,6 0.708,7 0.662,8 311.22,10 6,11 36,13 8,14 22,16 38,17 16,18 2,20 9,21 7,22 2,24 16,25 4,26 2,29 2,32 20,34 2,35 5.6,36 0.079,37 3,38 27,39 36.254,40 40.044,41 25.477,42 23.826,43 5.6,44 8.149}
{0 CHEMBL363510,1 8.187,2 44.1,3 44.1,4 1.009,5 1.118,6 0.694,7 0.653,8 278.37,10 6,11 34,13 8,14 21,16 36,17 15,20 9,21 6,22 2,23 1,24 15,25 4,26 1,29 2,31 1,32 19,34 1,35 5.9,36 0.083,37 3,38 26,39 34.313,40 38,41 23.585,42 22.214,43 2.9,44 6.658}
{0 CHEMBL364146,1 11.361,2 44.1,3 44.1,4 0.996,5 1.099,6 0.774,7 0.681,8 386.27,10 6,11 34,13 8,14 21,16 36,17 15,20 9,21 6,22 2,24 15,25 4,26 2,27 1,29 2,31 1,32 19,34 1,35 5.9,36 0.083,37 3,38 26,39 33.869,40 37.381,41 26.307,42 23.148,43 2.9,44 8.174}
{0 CHEMBL365092,1 7.761,2 47.5,3 45,4 0.992,5 1.102,6 0.71,7 0.659,8 310.44,10 11,11 40,13 13,14 25,16 43,17 19,20 13,21 6,22 2,24 18,25 3,26 1,29 2,31 1,32 22,35 5,36 0.07,37 3,38 32.5,39 39.683,40 44.076,41 28.409,42 26.358,44 8.097}
{0 CHEMBL373947,1 9.48,2 41.7,3 47.2,4 0.998,5 1.109,6 0.716,7 0.65,8 341.29,10 6,11 36,13 7,14 21,15 1,16 38,17 15,20 7,21 8,22 1,24 17,25 4,26 2,29 2,31 1,32 19,34 1,35 5.6,36 0.079,37 3,38 25,39 35.913,40 39.917,41 25.762,42 23.383,43 2.8,44 8.222}
{0 CHEMBL375262,1 9.202,2 41.7,3 44.4,4 1.009,5 1.11,6 0.726,7 0.667,8 331.28,10 6,11 36,13 7,14 22,16 38,17 15,18 2,20 7,21 8,22 1,24 16,25 5,26 3,29 2,31 1,32 20,34 2,35 5.6,36 0.079,37 3,38 26,39 36.331,40 39.964,41 26.125,42 24.013,43 5.6,44 8.161}
{0 CHEMBL375908,1 8.585,2 42.1,3 44.7,4 1.009,5 1.12,6 0.697,7 0.654,8 326.24,9 2.6,10 6,11 38,13 8,14 23,16 40,17 16,18 2,20 9,21 7,22 2,24 17,25 5,26 2,28 1,29 2,32 21,34 2,35 5.3,36 0.075,37 3,38 28,39 38.356,40 42.542,41 26.483,42 24.847,43 5.3,44 6.31}
{0 CHEMBL376107,1 9.202,2 41.7,3 44.4,4 1.009,5 1.11,6 0.726,7 0.667,8 331.28,10 6,11 36,13 7,14 22,16 38,17 15,18 2,20 7,21 8,22 1,24 16,25 5,26 3,29 2,31 1,32 20,34 2,35 5.6,36 0.079,37 3,38 26,39 36.331,40 39.964,41 26.125,42 24.013,43 5.6,44 7.658}
{0 CHEMBL376594,1 9.2,2 44.1,3 41.2,4 1.019,5 1.116,6 0.719,7 0.678,8 312.81,10 6,11 34,13 8,14 22,16 36,17 15,18 1,20 9,21 6,22 2,23 1,24 14,25 5,26 2,29 2,31 1,32 20,34 2,35 5.9,36 0.083,37 3,38 27,39 34.636,40 37.944,41 24.443,42 23.042,43 5.9,44 8}
{0 CHEMBL387505,1 9.2,2 44.1,3 41.2,4 1.019,5 1.116,6 0.719,7 0.678,8 312.81,10 6,11 34,13 8,14 22,16 36,17 15,18 1,20 9,21 6,22 2,23 1,24 14,25 5,26 2,29 2,31 1,32 20,34 2,35 5.9,36 0.083,37 3,38 27,39 34.636,40 37.944,41 24.443,42 23.042,43 5.9,44 8.119}
{0 CHEMBL387522,1 9.202,2 41.7,3 44.4,4 1.009,5 1.11,6 0.726,7 0.667,8 331.28,10 6,11 36,13 7,14 22,16 38,17 15,18 2,20 7,21 8,22 1,24 16,25 5,26 3,29 2,31 1,32 20,34 2,35 5.6,36 0.079,37 3,38 26,39 36.331,40 39.964,41 26.125,42 24.013,43 5.6,44 8}
{0 CHEMBL387716,1 9.386,2 40.5,3 43.2,4 1.018,5 1.113,6 0.718,7 0.668,8 347.28,10 6,11 37,13 8,14 23,16 39,17 15,18 2,20 7,21 8,22 2,24 16,25 6,26 3,29 3,31 1,32 21,34 2,35 8.1,36 0.077,37 3,38 28,39 37.658,40 41.173,41 26.58,42 24.728,43 5.4,44 8.108}
{0 CHEMBL387983,1 7.44,2 45.2,3 47.6,4 0.99,5 1.107,6 0.695,7 0.64,8 312.46,10 11,11 42,13 12,14 25,16 45,17 19,20 11,21 8,22 1,24 20,25 3,26 1,29 2,31 1,32 22,35 4.8,36 0.067,37 3,38 31.5,39 41.567,40 46.491,41 29.171,42 26.885,44 7.796}
{0 CHEMBL388105,1 8.745,2 41.7,3 44.4,4 1.014,5 1.121,6 0.7,7 0.655,8 314.83,10 6,11 36,13 7,14 22,16 38,17 15,18 1,20 7,21 8,22 1,23 1,24 16,25 5,26 2,29 2,31 1,32 20,34 2,35 5.6,36 0.079,37 3,38 26,39 36.52,40 40.359,41 25.205,42 23.569,43 5.6,44 8.174}
{0 CHEMBL388300,1 9.684,2 44.1,3 41.2,4 1.013,5 1.104,6 0.746,7 0.691,8 329.26,10 6,11 34,13 8,14 22,16 36,17 15,18 2,20 9,21 6,22 2,24 14,25 5,26 3,29 2,31 1,32 20,34 2,35 5.9,36 0.083,37 3,38 27,39 34.447,40 37.548,41 25.364,42 23.486,43 5.9,44 8.301}
{0 CHEMBL388411,1 9.48,2 41.7,3 47.2,4 0.998,5 1.109,6 0.716,7 0.65,8 341.29,10 6,11 36,13 7,14 21,15 1,16 38,17 15,20 7,21 8,22 1,24 17,25 4,26 2,29 2,31 1,32 19,34 1,35 5.6,36 0.079,37 3,38 25,39 35.913,40 39.917,41 25.762,42 23.383,43 2.8,44 8.222}
{0 CHEMBL388412,1 8.397,2 39,3 46.3,4 1.014,5 1.126,6 0.676,7 0.636,8 344.26,9 2.4,10 6,11 41,13 7,14 24,16 43,17 16,18 2,20 7,21 9,22 1,24 19,25 6,26 2,28 1,29 3,32 22,34 2,35 7.3,36 0.07,37 3,38 28,39 41.567,40 46.167,41 27.699,42 26.089,43 4.9,44 5.57}
{0 CHEMBL388545,1 8.243,2 42.1,3 47.4,4 1.004,5 1.117,6 0.69,7 0.641,8 313.24,10 6,11 38,13 7,14 22,16 40,17 16,18 2,20 7,21 9,22 1,24 18,25 4,26 2,29 2,32 20,34 2,35 5.3,36 0.075,37 3,38 26,39 38.138,40 42.459,41 26.239,42 24.353,43 5.3,44 8.018}
{0 CHEMBL388608,1 8.775,2 41,3 43.6,4 1.018,5 1.122,6 0.691,7 0.655,8 342.24,9 2.6,10 6,11 39,13 8,14 24,16 41,17 16,18 2,20 9,21 7,22 2,24 17,25 6,26 2,28 1,29 3,32 22,34 2,35 7.7,36 0.073,37 3,38 29,39 39.684,40 43.751,41 26.938,42 25.562,43 5.1,44 8.131}
{0 CHEMBL388633,1 8.585,2 42.1,3 44.7,4 1.009,5 1.12,6 0.697,7 0.654,8 326.24,9 2.6,10 6,11 38,13 8,14 23,16 40,17 16,18 2,20 9,21 7,22 2,24 17,25 5,26 2,28 1,29 2,32 21,34 2,35 5.3,36 0.075,37 3,38 28,39 38.356,40 42.542,41 26.483,42 24.847,43 5.3,44 8.921}
{0 CHEMBL388856,1 8.941,2 40.5,3 43.2,4 1.023,5 1.123,6 0.693,7 0.656,8 330.83,10 6,11 37,13 8,14 23,16 39,17 15,18 1,20 7,21 8,22 2,23 1,24 16,25 6,26 2,29 3,31 1,32 21,34 2,35 8.1,36 0.077,37 3,38 28,39 37.847,40 41.569,41 25.659,42 24.284,43 5.4,44 7.77}
{0 CHEMBL389076,1 8.745,2 41.7,3 44.4,4 1.014,5 1.121,6 0.7,7 0.655,8 314.83,10 6,11 36,13 7,14 22,16 38,17 15,18 1,20 7,21 8,22 1,23 1,24 16,25 5,26 2,29 2,31 1,32 20,34 2,35 5.6,36 0.079,37 3,38 26,39 36.52,40 40.359,41 25.205,42 23.569,43 5.6,44 8.149}
{0 CHEMBL389159,1 7.789,2 41.7,3 47.2,4 1.005,5 1.123,6 0.676,7 0.632,8 280.39,10 6,11 36,13 7,14 21,16 38,17 15,20 7,21 8,22 1,23 1,24 17,25 4,26 1,29 2,31 1,32 19,34 1,35 5.6,36 0.079,37 3,38 25,39 36.196,40 40.415,41 24.347,42 22.741,43 2.8,44 7.229}
{0 CHEMBL389672,1 10.786,2 41.7,3 47.2,4 0.993,5 1.105,6 0.752,7 0.658,8 388.29,10 6,11 36,13 7,14 21,16 38,17 15,20 7,21 8,22 1,24 17,25 4,26 2,27 1,29 2,31 1,32 19,34 1,35 5.6,36 0.079,37 3,38 25,39 35.753,40 39.796,41 27.068,42 23.675,43 2.8,44 7.854}
{0 CHEMBL389899,1 7.897,2 42.9,3 45.7,4 1.004,5 1.111,6 0.689,7 0.644,8 276.38,10 6,11 35,13 9,14 21,16 37,17 15,20 9,21 6,22 3,24 16,25 4,26 1,29 3,31 1,32 19,35 8.6,36 0.081,37 3,38 27,39 35.127,40 38.87,41 24.102,42 22.546,44 5.222}
{0 CHEMBL390286,1 8.745,2 41.7,3 44.4,4 1.014,5 1.121,6 0.7,7 0.655,8 314.83,10 6,11 36,13 7,14 22,16 38,17 15,18 1,20 7,21 8,22 1,23 1,24 16,25 5,26 2,29 2,31 1,32 20,34 2,35 5.6,36 0.079,37 3,38 26,39 36.52,40 40.359,41 25.205,42 23.569,43 5.6,44 8.155}
{0 CHEMBL390392,1 8.756,2 41.7,3 44.4,4 1.016,5 1.118,6 0.693,7 0.654,8 315.21,10 6,11 36,13 7,14 22,16 38,17 15,18 2,20 7,21 8,22 1,24 16,25 5,26 2,29 3,32 20,34 2,35 8.3,36 0.079,37 3,38 26,39 36.582,40 40.253,41 24.932,42 23.541,43 5.6,44 8.509}
{0 CHEMBL390492,1 7.789,2 41.7,3 47.2,4 1.005,5 1.123,6 0.676,7 0.632,8 280.39,10 6,11 36,13 7,14 21,16 38,17 15,20 7,21 8,22 1,23 1,24 17,25 4,26 1,29 2,31 1,32 19,34 1,35 5.6,36 0.079,37 3,38 25,39 36.196,40 40.415,41 24.347,42 22.741,43 2.8,44 7.42}
{0 CHEMBL390712,1 8.756,2 41.7,3 44.4,4 1.016,5 1.118,6 0.693,7 0.654,8 315.21,10 6,11 36,13 7,14 22,16 38,17 15,18 2,20 7,21 8,22 1,24 16,25 5,26 2,29 3,32 20,34 2,35 8.3,36 0.079,37 3,38 26,39 36.582,40 40.253,41 24.932,42 23.541,43 5.6,44 8.638}
{0 CHEMBL390764,1 8.756,2 41.7,3 44.4,4 1.016,5 1.118,6 0.693,7 0.654,8 315.21,10 6,11 36,13 7,14 22,16 38,17 15,18 2,20 7,21 8,22 1,24 16,25 5,26 2,29 3,32 20,34 2,35 8.3,36 0.079,37 3,38 26,39 36.582,40 40.253,41 24.932,42 23.541,43 5.6,44 7.328}
{0 CHEMBL390929,1 8.756,2 41.7,3 44.4,4 1.016,5 1.118,6 0.693,7 0.654,8 315.21,10 6,11 36,13 7,14 22,16 38,17 15,18 2,20 7,21 8,22 1,24 16,25 5,26 2,29 3,32 20,34 2,35 8.3,36 0.079,37 3,38 26,39 36.582,40 40.253,41 24.932,42 23.541,43 5.6,44 8.481}
{0 CHEMBL426752,1 8.288,2 41.7,3 44.4,4 1.02,5 1.132,6 0.675,7 0.642,8 298.38,10 6,11 36,13 7,14 22,16 38,17 15,20 7,21 8,22 1,23 2,24 16,25 5,26 1,29 2,31 1,32 20,34 2,35 5.6,36 0.079,37 3,38 26,39 36.709,40 40.755,41 24.284,42 23.125,43 5.6,44 7.495}
{0 CHEMBL437874,1 8.397,2 39,3 46.3,4 1.014,5 1.126,6 0.676,7 0.636,8 344.26,9 2.4,10 6,11 41,13 7,14 24,16 43,17 16,18 2,20 7,21 9,22 1,24 19,25 6,26 2,28 1,29 3,32 22,34 2,35 7.3,36 0.07,37 3,38 28,39 41.567,40 46.167,41 27.699,42 26.089,43 4.9,44 9.119}
{0 CHEMBL449654,1 9.211,2 44.1,3 41.2,4 1.021,5 1.113,6 0.711,7 0.677,8 313.19,10 6,11 34,13 8,14 22,16 36,17 15,18 2,20 9,21 6,22 2,24 14,25 5,26 2,29 3,32 20,34 2,35 8.8,36 0.083,37 3,38 27,39 34.698,40 37.838,41 24.171,42 23.014,43 5.9,44 7.237}
