{
  "data_features": {
    "feature": [
      {
        "data_type": "nominal",
        "index": "0",
        "is_ignore": "false",
        "is_row_identifier": "true",
        "is_target": "false",
        "name": "molecule_id",
        "nominal_value": [
          "CHEMBL163719",
          "CHEMBL163740",
          "CHEMBL163771",
          "CHEMBL164134",
          "CHEMBL164399",
          "CHEMBL164760",
          "CHEMBL164917",
          "CHEMBL165049",
          "CHEMBL165086",
          "CHEMBL165217",
          "CHEMBL165444",
          "CHEMBL165445",
          "CHEMBL167147",
          "CHEMBL167384",
          "CHEMBL167512",
          "CHEMBL167935",
          "CHEMBL167987",
          "CHEMBL168066",
          "CHEMBL168099",
          "CHEMBL23",
          "CHEMBL262509",
          "CHEMBL315809",
          "CHEMBL319525",
          "CHEMBL348940",
          "CHEMBL349140",
          "CHEMBL349193",
          "CHEMBL349753",
          "CHEMBL350321",
          "CHEMBL351235",
          "CHEMBL351402",
          "CHEMBL352750",
          "CHEMBL353566",
          "CHEMBL353757",
          "CHEMBL354353",
          "CHEMBL354933",
          "CHEMBL355684",
          "CHEMBL410539",
          "CHEMBL89099",
          "CHEMBL96454",
          "CHEMBL98189"
        ],
        "number_of_missing_values": "0"
      },
      {
        "data_type": "numeric",
        "index": "1",
        "is_ignore": "false",
        "is_row_identifier": "false",
        "is_target": "false",
        "name": "O.",
        "number_of_missing_values": "0"
      },
      {
        "data_type": "numeric",
        "index": "2",
        "is_ignore": "false",
        "is_row_identifier": "false",
        "is_target": "false",
        "name": "nO",
        "number_of_missing_values": "0"
      },
      {
        "data_type": "numeric",
        "index": "3",
        "is_ignore": "false",
        "is_row_identifier": "false",
        "is_target": "false",
        "name": "AMW",
        "number_of_missing_values": "0"
      },
      {
        "data_type": "numeric",
        "index": "4",
        "is_ignore": "false",
        "is_row_identifier": "false",
        "is_target": "false",
        "name": "C.",
        "number_of_missing_values": "0"
      },
      {
        "data_type": "numeric",
        "index": "5",
        "is_ignore": "false",
        "is_row_identifier": "false",
        "is_target": "true",
        "name": "pXC50",
        "number_of_missing_values": "0"
      }
    ]
  }
}