{
  "data_features": {
    "feature": [
      {
        "data_type": "nominal",
        "index": "0",
        "is_ignore": "false",
        "is_row_identifier": "true",
        "is_target": "false",
        "name": "molecule_id",
        "nominal_value": [
          "CHEMBL101744",
          "CHEMBL102040",
          "CHEMBL106101",
          "CHEMBL106253",
          "CHEMBL106872",
          "CHEMBL106880",
          "CHEMBL1076554",
          "CHEMBL1080152",
          "CHEMBL1080153",
          "CHEMBL1080674",
          "CHEMBL1082013",
          "CHEMBL109741",
          "CHEMBL110640",
          "CHEMBL110823",
          "CHEMBL1197763",
          "CHEMBL1210154",
          "CHEMBL1253632",
          "CHEMBL1253633",
          "CHEMBL1253634",
          "CHEMBL1253635",
          "CHEMBL1253636",
          "CHEMBL1253637",
          "CHEMBL1254974",
          "CHEMBL1255058",
          "CHEMBL1256748",
          "CHEMBL133454",
          "CHEMBL133836",
          "CHEMBL134067",
          "CHEMBL13470",
          "CHEMBL139081",
          "CHEMBL141863",
          "CHEMBL149414",
          "CHEMBL1500",
          "CHEMBL150967",
          "CHEMBL151270",
          "CHEMBL154140",
          "CHEMBL154309",
          "CHEMBL155519",
          "CHEMBL15595",
          "CHEMBL157125",
          "CHEMBL158249",
          "CHEMBL163334",
          "CHEMBL163871",
          "CHEMBL165885",
          "CHEMBL166108",
          "CHEMBL166312",
          "CHEMBL166387",
          "CHEMBL166445",
          "CHEMBL168578",
          "CHEMBL169183",
          "CHEMBL169947",
          "CHEMBL170594",
          "CHEMBL171763",
          "CHEMBL172971",
          "CHEMBL174533",
          "CHEMBL174569",
          "CHEMBL174894",
          "CHEMBL175116",
          "CHEMBL175342",
          "CHEMBL175511",
          "CHEMBL176037",
          "CHEMBL176806",
          "CHEMBL177610",
          "CHEMBL177647",
          "CHEMBL177720",
          "CHEMBL178895",
          "CHEMBL19019",
          "CHEMBL1908334",
          "CHEMBL191597",
          "CHEMBL194545",
          "CHEMBL194708",
          "CHEMBL195344",
          "CHEMBL2021558",
          "CHEMBL2021573",
          "CHEMBL2048965",
          "CHEMBL2048966",
          "CHEMBL2048967",
          "CHEMBL2048968",
          "CHEMBL2048969",
          "CHEMBL2048970",
          "CHEMBL2048971",
          "CHEMBL2048972",
          "CHEMBL20750",
          "CHEMBL2110227",
          "CHEMBL2110229",
          "CHEMBL2110337",
          "CHEMBL211226",
          "CHEMBL2112373",
          "CHEMBL2112374",
          "CHEMBL2112953",
          "CHEMBL2112954",
          "CHEMBL2112960",
          "CHEMBL2114469",
          "CHEMBL2114470",
          "CHEMBL2115492",
          "CHEMBL2115493",
          "CHEMBL212375",
          "CHEMBL216640",
          "CHEMBL222287",
          "CHEMBL22650",
          "CHEMBL231536",
          "CHEMBL231537",
          "CHEMBL231638",
          "CHEMBL23529",
          "CHEMBL237054",
          "CHEMBL261992",
          "CHEMBL262310",
          "CHEMBL262838",
          "CHEMBL262963",
          "CHEMBL263575",
          "CHEMBL268818",
          "CHEMBL269849",
          "CHEMBL274558",
          "CHEMBL281786",
          "CHEMBL287392",
          "CHEMBL307595",
          "CHEMBL309491",
          "CHEMBL311145",
          "CHEMBL311352",
          "CHEMBL316446",
          "CHEMBL318297",
          "CHEMBL318298",
          "CHEMBL318859",
          "CHEMBL319202",
          "CHEMBL319444",
          "CHEMBL320335",
          "CHEMBL321170",
          "CHEMBL325347",
          "CHEMBL325560",
          "CHEMBL325568",
          "CHEMBL330751",
          "CHEMBL332242",
          "CHEMBL333357",
          "CHEMBL334511",
          "CHEMBL335969",
          "CHEMBL336437",
          "CHEMBL337272",
          "CHEMBL340032",
          "CHEMBL341805",
          "CHEMBL343956",
          "CHEMBL345163",
          "CHEMBL345377",
          "CHEMBL346163",
          "CHEMBL346240",
          "CHEMBL346354",
          "CHEMBL348564",
          "CHEMBL349738",
          "CHEMBL351976",
          "CHEMBL353745",
          "CHEMBL353943",
          "CHEMBL353990",
          "CHEMBL354065",
          "CHEMBL354291",
          "CHEMBL354545",
          "CHEMBL354641",
          "CHEMBL354652",
          "CHEMBL355141",
          "CHEMBL355153",
          "CHEMBL355202",
          "CHEMBL355367",
          "CHEMBL355580",
          "CHEMBL359154",
          "CHEMBL363482",
          "CHEMBL364058",
          "CHEMBL365533",
          "CHEMBL365547",
          "CHEMBL368835",
          "CHEMBL368861",
          "CHEMBL369499",
          "CHEMBL370678",
          "CHEMBL370680",
          "CHEMBL385696",
          "CHEMBL386492",
          "CHEMBL399708",
          "CHEMBL401093",
          "CHEMBL405057",
          "CHEMBL405307",
          "CHEMBL405618",
          "CHEMBL405721",
          "CHEMBL406229",
          "CHEMBL407084",
          "CHEMBL407529",
          "CHEMBL410152",
          "CHEMBL411282",
          "CHEMBL412228",
          "CHEMBL413832",
          "CHEMBL414360",
          "CHEMBL414477",
          "CHEMBL414904",
          "CHEMBL415330",
          "CHEMBL415795",
          "CHEMBL415818",
          "CHEMBL420562",
          "CHEMBL423466",
          "CHEMBL423794",
          "CHEMBL425016",
          "CHEMBL426776",
          "CHEMBL428669",
          "CHEMBL429351",
          "CHEMBL430081",
          "CHEMBL433720",
          "CHEMBL433978",
          "CHEMBL434685",
          "CHEMBL435108",
          "CHEMBL436039",
          "CHEMBL436243",
          "CHEMBL438044",
          "CHEMBL438223",
          "CHEMBL438781",
          "CHEMBL439272",
          "CHEMBL440449",
          "CHEMBL440810",
          "CHEMBL440928",
          "CHEMBL441198",
          "CHEMBL445332",
          "CHEMBL46",
          "CHEMBL462287",
          "CHEMBL467221",
          "CHEMBL467448",
          "CHEMBL485832",
          "CHEMBL502411",
          "CHEMBL506616",
          "CHEMBL550968",
          "CHEMBL553657",
          "CHEMBL555959",
          "CHEMBL558004",
          "CHEMBL564095",
          "CHEMBL567175",
          "CHEMBL573214",
          "CHEMBL574556",
          "CHEMBL574567",
          "CHEMBL574568",
          "CHEMBL584594",
          "CHEMBL584595",
          "CHEMBL584596",
          "CHEMBL584799",
          "CHEMBL584800",
          "CHEMBL584801",
          "CHEMBL585003",
          "CHEMBL593613",
          "CHEMBL593844",
          "CHEMBL595015",
          "CHEMBL595448",
          "CHEMBL595449",
          "CHEMBL596371",
          "CHEMBL604903",
          "CHEMBL605307",
          "CHEMBL605510",
          "CHEMBL606707",
          "CHEMBL606768",
          "CHEMBL607014",
          "CHEMBL607015",
          "CHEMBL607064",
          "CHEMBL607065",
          "CHEMBL607066",
          "CHEMBL607347",
          "CHEMBL607348",
          "CHEMBL607349",
          "CHEMBL607350",
          "CHEMBL608245",
          "CHEMBL608246",
          "CHEMBL608815",
          "CHEMBL60936",
          "CHEMBL610028",
          "CHEMBL610030",
          "CHEMBL610279",
          "CHEMBL610280",
          "CHEMBL610286",
          "CHEMBL610287",
          "CHEMBL610535",
          "CHEMBL610543",
          "CHEMBL610544",
          "CHEMBL610546",
          "CHEMBL611957",
          "CHEMBL62688",
          "CHEMBL656",
          "CHEMBL70",
          "CHEMBL74791",
          "CHEMBL75668",
          "CHEMBL75831",
          "CHEMBL76062",
          "CHEMBL76527",
          "CHEMBL76816",
          "CHEMBL79443",
          "CHEMBL80",
          "CHEMBL80116",
          "CHEMBL81355",
          "CHEMBL92665",
          "CHEMBL92917",
          "CHEMBL93543",
          "CHEMBL96273",
          "CHEMBL963",
          "CHEMBL96525",
          "CHEMBL96609"
        ],
        "number_of_missing_values": "0"
      },
      {
        "data_type": "numeric",
        "index": "1",
        "is_ignore": "false",
        "is_row_identifier": "false",
        "is_target": "false",
        "name": "C.",
        "number_of_missing_values": "0"
      },
      {
        "data_type": "numeric",
        "index": "2",
        "is_ignore": "false",
        "is_row_identifier": "false",
        "is_target": "false",
        "name": "nHet",
        "number_of_missing_values": "0"
      },
      {
        "data_type": "numeric",
        "index": "3",
        "is_ignore": "false",
        "is_row_identifier": "false",
        "is_target": "false",
        "name": "nN",
        "number_of_missing_values": "0"
      },
      {
        "data_type": "numeric",
        "index": "4",
        "is_ignore": "false",
        "is_row_identifier": "false",
        "is_target": "false",
        "name": "nDB",
        "number_of_missing_values": "0"
      },
      {
        "data_type": "numeric",
        "index": "5",
        "is_ignore": "false",
        "is_row_identifier": "false",
        "is_target": "false",
        "name": "MW",
        "number_of_missing_values": "0"
      },
      {
        "data_type": "numeric",
        "index": "6",
        "is_ignore": "false",
        "is_row_identifier": "false",
        "is_target": "false",
        "name": "nAT",
        "number_of_missing_values": "0"
      },
      {
        "data_type": "numeric",
        "index": "7",
        "is_ignore": "false",
        "is_row_identifier": "false",
        "is_target": "false",
        "name": "nBO",
        "number_of_missing_values": "0"
      },
      {
        "data_type": "numeric",
        "index": "8",
        "is_ignore": "false",
        "is_row_identifier": "false",
        "is_target": "false",
        "name": "nBT",
        "number_of_missing_values": "0"
      },
      {
        "data_type": "numeric",
        "index": "9",
        "is_ignore": "false",
        "is_row_identifier": "false",
        "is_target": "false",
        "name": "nC",
        "number_of_missing_values": "0"
      },
      {
        "data_type": "numeric",
        "index": "10",
        "is_ignore": "false",
        "is_row_identifier": "false",
        "is_target": "false",
        "name": "nH",
        "number_of_missing_values": "0"
      },
      {
        "data_type": "numeric",
        "index": "11",
        "is_ignore": "false",
        "is_row_identifier": "false",
        "is_target": "false",
        "name": "nO",
        "number_of_missing_values": "0"
      },
      {
        "data_type": "numeric",
        "index": "12",
        "is_ignore": "false",
        "is_row_identifier": "false",
        "is_target": "true",
        "name": "pXC50",
        "number_of_missing_values": "0"
      }
    ]
  }
}