{
  "data_features": {
    "feature": [
      {
        "data_type": "nominal",
        "index": "0",
        "is_ignore": "false",
        "is_row_identifier": "true",
        "is_target": "false",
        "name": "molecule_id",
        "nominal_value": [
          "CHEMBL1926700",
          "CHEMBL1928119",
          "CHEMBL1928120",
          "CHEMBL1928121",
          "CHEMBL1928122",
          "CHEMBL1928123",
          "CHEMBL1928124",
          "CHEMBL1928125",
          "CHEMBL1928126",
          "CHEMBL1928127",
          "CHEMBL1928128",
          "CHEMBL1928129",
          "CHEMBL1928130",
          "CHEMBL1928131",
          "CHEMBL1928132",
          "CHEMBL1928133",
          "CHEMBL1928134",
          "CHEMBL1928135",
          "CHEMBL1928136",
          "CHEMBL1928137",
          "CHEMBL1928138",
          "CHEMBL1928139",
          "CHEMBL1928247",
          "CHEMBL1928248"
        ],
        "number_of_missing_values": "0"
      },
      {
        "data_type": "numeric",
        "index": "1",
        "is_ignore": "false",
        "is_row_identifier": "false",
        "is_target": "false",
        "name": "AMW",
        "number_of_missing_values": "0"
      },
      {
        "data_type": "numeric",
        "index": "2",
        "is_ignore": "false",
        "is_row_identifier": "false",
        "is_target": "false",
        "name": "C.",
        "number_of_missing_values": "0"
      },
      {
        "data_type": "numeric",
        "index": "3",
        "is_ignore": "false",
        "is_row_identifier": "false",
        "is_target": "true",
        "name": "pXC50",
        "number_of_missing_values": "0"
      }
    ]
  }
}