"molecule_id","AMW","C.","H.","Me","Mi","Mp","Mv","MW","N.","nAB","nAT","nB","nBM","nBO","nBR","nBT","nC","nCL","nCsp","nCsp2","nCsp3","nDB","nF","nH","nHet","nHM","nI","nN","nO","nP","nS","nSK","nTB","nX","O.","RBF","RBN","SCBO","Se","Si","Sp","Sv","X.","pXC50"
{1 7.735,2 43.1,3 43.1,4 1.013,5 1.121,6 0.665,7 0.645,8 394.46,9 3.9,10 16,11 51,13 19,14 31,16 53,17 22,20 17,21 5,22 3,24 22,25 7,28 2,29 5,32 29,35 9.8,36 0.151,37 8,38 42,39 51.676,40 57.196,41 33.898,42 32.885,44 7.699}
{0 CHEMBL148674,1 7.926,2 43.8,3 41.7,4 1.017,5 1.12,6 0.67,7 0.653,8 380.43,9 4.2,10 16,11 48,13 19,14 30,16 50,17 21,20 17,21 4,22 3,24 20,25 7,28 2,29 5,32 28,35 10.4,36 0.16,37 8,38 41,39 48.793,40 53.78,41 32.137,42 31.358,44 7.125}
{0 CHEMBL208315,1 7.735,2 43.1,3 43.1,4 1.013,5 1.121,6 0.665,7 0.645,8 394.46,9 3.9,10 16,11 51,13 19,14 31,16 53,17 22,20 17,21 5,22 3,24 22,25 7,28 2,29 5,32 29,35 9.8,36 0.151,37 8,38 42,39 51.676,40 57.196,41 33.898,42 32.885,44 7.125}
{0 CHEMBL208429,1 7.926,2 43.8,3 41.7,4 1.017,5 1.12,6 0.67,7 0.653,8 380.43,9 4.2,10 16,11 48,13 19,14 30,16 50,17 21,20 17,21 4,22 3,24 20,25 7,28 2,29 5,32 28,35 10.4,36 0.14,37 7,38 41,39 48.793,40 53.78,41 32.137,42 31.358,44 5.602}
{0 CHEMBL332993,1 7.871,2 46.6,3 41.4,4 1.01,5 1.114,6 0.684,7 0.662,8 456.53,9 3.4,10 22,11 58,13 25,14 37,16 61,17 27,20 23,21 4,22 3,24 24,25 7,28 2,29 5,32 34,35 8.6,36 0.148,37 9,38 51,39 58.56,40 64.611,41 39.659,42 38.412,44 6.046}
{0 CHEMBL346196,1 8.142,2 44.4,3 40,4 1.02,5 1.119,6 0.675,7 0.663,8 366.4,9 4.4,10 16,11 45,13 19,14 29,16 47,17 20,20 17,21 3,22 3,24 18,25 7,28 2,29 5,32 27,35 11.1,36 0.149,37 7,38 40,39 45.909,40 50.365,41 30.375,42 29.831,44 5.602}
{0 CHEMBL444450,1 6.357,2 39.1,3 53.9,4 0.991,5 1.126,6 0.628,7 0.583,8 731.07,10 18,11 115,13 20,14 56,16 118,17 45,20 20,21 25,22 2,24 62,25 8,29 8,32 53,35 7,36 0.203,37 24,38 67,39 114.01,40 129.546,41 72.239,42 67.049,44 5.796}
{0 CHEMBL446349,1 8.378,2 45.6,3 39.7,4 1.014,5 1.113,6 0.699,7 0.674,8 569.68,9 4.4,10 27,11 68,13 32,14 45,16 72,17 31,20 27,21 4,22 5,24 27,25 10,26 1,28 3,29 6,31 1,32 41,35 8.8,36 0.139,37 10,38 63.5,39 68.949,40 75.654,41 47.529,42 45.862,44 7.456}
{0 CHEMBL455273,1 8.008,2 39.3,3 42.9,4 1.034,5 1.126,6 0.637,7 0.633,8 224.23,10 6,11 28,13 8,14 16,16 28,17 11,20 8,21 3,22 2,24 12,25 5,29 5,32 16,35 17.9,36 0.071,37 2,38 21,39 28.938,40 31.538,41 17.841,42 17.735,44 5.796}
{0 CHEMBL470757,1 5.774,2 35.3,3 58.8,4 0.985,5 1.134,6 0.604,7 0.55,8 490.8,10 6,11 85,13 8,14 35,16 85,17 30,20 8,21 22,22 2,24 50,25 5,29 5,32 35,35 5.9,36 0.259,37 22,38 40,39 83.727,40 96.427,41 51.307,42 46.744,44 5.796}
{0 CHEMBL478820,1 7.572,2 45.3,3 43.8,4 1.005,5 1.116,6 0.675,7 0.648,8 484.59,9 3.1,10 22,11 64,13 25,14 39,16 67,17 29,20 23,21 6,22 3,24 28,25 7,28 2,29 5,32 36,35 7.8,36 0.149,37 10,38 53,39 64.327,40 71.441,41 43.182,42 41.465,44 5.796}
{0 CHEMBL478821,1 7.5,2 47.3,3 43.6,4 0.998,5 1.113,6 0.686,7 0.654,8 412.52,9 3.6,10 22,11 55,13 24,14 34,16 58,17 26,20 22,21 4,22 2,24 24,25 5,28 2,29 3,32 31,35 5.5,36 0.121,37 7,38 47,39 54.905,40 61.192,41 37.75,42 35.982,44 5.796}
{0 CHEMBL479251,1 8.054,2 42.6,3 42.6,4 1.012,5 1.119,6 0.681,7 0.653,8 547.68,9 4.4,10 22,11 68,13 27,14 42,16 71,17 29,20 23,21 6,22 5,24 29,25 10,26 1,28 3,29 6,31 1,32 39,35 8.8,36 0.155,37 11,38 58,39 68.832,40 76.069,41 46.29,42 44.388,44 5.796}
{0 CHEMBL483761,1 5.544,2 34.9,3 60.5,4 0.98,5 1.135,6 0.6,7 0.541,8 476.82,10 6,11 86,13 7,14 34,16 86,17 30,20 7,21 23,22 1,24 52,25 4,29 4,32 34,35 4.7,36 0.256,37 22,38 38,39 84.283,40 97.633,41 51.614,42 46.556,44 5.796}
{0 CHEMBL483770,1 6.206,2 36.1,3 55.7,4 0.994,5 1.133,6 0.61,7 0.566,8 378.56,10 6,11 61,13 8,14 27,16 61,17 22,20 8,21 14,22 2,24 34,25 5,29 5,32 27,35 8.2,36 0.213,37 13,38 32,39 60.658,40 69.105,41 37.216,42 34.53,44 5.796}
{0 CHEMBL484180,1 5.498,2 36,3 60.5,4 0.976,5 1.133,6 0.607,7 0.545,8 472.83,10 6,11 86,13 8,14 34,16 86,17 31,20 8,21 23,22 2,24 52,25 3,29 3,32 34,35 3.5,36 0.256,37 22,38 39,39 83.956,40 97.423,41 52.16,42 46.841,44 5.796}
{0 CHEMBL485443,1 6.285,2 36.2,3 55.2,4 0.996,5 1.133,6 0.611,7 0.569,8 364.53,10 6,11 58,13 8,14 26,16 58,17 21,20 8,21 13,22 2,24 32,25 5,29 5,32 26,35 8.6,36 0.207,37 12,38 31,39 57.774,40 65.69,41 35.455,42 33.003,44 5.796}
{0 CHEMBL485601,1 5.737,2 35.2,3 59.1,4 0.984,5 1.135,6 0.603,7 0.549,8 504.83,10 6,11 88,13 8,14 36,16 88,17 31,20 8,21 23,22 2,24 52,25 5,29 5,32 36,35 5.7,36 0.25,37 22,38 41,39 86.61,40 99.842,41 53.069,42 48.271,44 5.796}
{0 CHEMBL485614,1 5.652,2 35.7,3 59.5,4 0.981,5 1.134,6 0.605,7 0.548,8 474.8,10 6,11 84,13 8,14 34,16 84,17 30,20 8,21 22,22 2,24 50,25 4,29 4,32 34,35 4.8,36 0.262,37 22,38 39,39 82.399,40 95.218,41 50.853,42 46.029,44 5.796}
{0 CHEMBL504813,1 7.565,2 42.6,3 44.4,4 1.01,5 1.122,6 0.66,7 0.637,8 408.49,9 3.7,10 16,11 54,13 19,14 32,16 56,17 23,20 17,21 6,22 3,24 24,25 7,28 2,29 5,32 30,35 9.3,36 0.161,37 9,38 43,39 54.56,40 60.611,41 35.659,42 34.412,44 5.796}
{0 CHEMBL506485,1 8.078,2 44.6,3 41.9,4 1.01,5 1.115,6 0.69,7 0.661,8 597.74,9 4.1,10 27,11 74,13 32,14 47,16 78,17 33,20 27,21 6,22 5,24 31,25 10,26 1,28 3,29 6,31 1,32 43,35 8.1,36 0.141,37 11,38 65.5,39 74.716,40 82.484,41 51.051,42 48.915,44 5.796}
{0 CHEMBL514692,1 8.381,2 43.5,3 40.3,4 1.017,5 1.117,6 0.69,7 0.667,8 519.62,9 4.8,10 22,11 62,13 27,14 40,16 65,17 27,20 23,21 4,22 5,24 25,25 10,26 1,28 3,29 6,31 1,32 37,35 9.7,36 0.154,37 10,38 56,39 63.065,40 69.239,41 42.767,42 41.335,44 7.523}
{0 CHEMBL514705,1 7.642,2 45,3 43.3,4 1.007,5 1.117,6 0.674,7 0.649,8 458.55,9 3.3,10 21,11 60,13 24,14 37,16 63,17 27,20 21,21 6,22 3,24 26,25 7,28 2,29 5,32 34,35 8.3,36 0.143,37 9,38 50.5,39 60.443,40 67.026,41 40.421,42 38.938,44 5.796}
{0 CHEMBL514841,1 7.578,2 47.1,3 43.1,4 1,5 1.113,6 0.686,7 0.656,8 386.48,9 3.9,10 21,11 51,13 23,14 32,16 54,17 24,20 20,21 4,22 2,24 22,25 5,28 2,29 3,32 29,35 5.9,36 0.111,37 6,38 44.5,39 51.022,40 56.777,41 34.989,42 33.455,44 5.796}
{0 CHEMBL515637,1 7.972,2 46.3,3 40.7,4 1.013,5 1.115,6 0.683,7 0.665,8 430.49,9 3.7,10 21,11 54,13 24,14 35,16 57,17 25,20 21,21 4,22 3,24 22,25 7,28 2,29 5,32 32,35 9.3,36 0.14,37 8,38 48.5,39 54.676,40 60.196,41 36.898,42 35.885,44 8.222}
{0 CHEMBL517821,1 7.576,2 46.7,3 43.3,4 1.002,5 1.114,6 0.683,7 0.654,8 454.56,9 3.3,10 22,11 60,13 25,14 37,16 63,17 28,20 23,21 5,22 3,24 26,25 6,28 2,29 4,32 34,35 6.7,36 0.143,37 9,38 51,39 60.116,40 66.817,41 40.966,42 39.224,44 5.796}
{0 CHEMBL520514,1 7.842,2 47.9,3 41.7,4 1.01,5 1.108,6 0.685,7 0.663,8 376.43,10 18,11 48,13 20,14 30,16 50,17 23,20 20,21 3,22 2,24 20,25 5,29 5,32 28,35 10.4,36 0.12,37 6,38 41,39 48.473,40 53.199,41 32.887,42 31.842,44 5.796}
