"molecule_id","FCFP4_1024b943","FCFP4_1024b799","FCFP4_1024b862","FCFP4_1024b131","FCFP4_1024b454","FCFP4_1024b270","FCFP4_1024b1","FCFP4_1024b10","FCFP4_1024b100","FCFP4_1024b1000","FCFP4_1024b1001","FCFP4_1024b1002","FCFP4_1024b1003","FCFP4_1024b1004","FCFP4_1024b1005","FCFP4_1024b1006","FCFP4_1024b1007","FCFP4_1024b1008","FCFP4_1024b1009","FCFP4_1024b101","FCFP4_1024b1010","FCFP4_1024b1011","FCFP4_1024b1012","FCFP4_1024b1013","FCFP4_1024b1014","FCFP4_1024b1015","FCFP4_1024b1016","FCFP4_1024b1017","FCFP4_1024b1018","FCFP4_1024b1019","FCFP4_1024b102","FCFP4_1024b1020","FCFP4_1024b1021","FCFP4_1024b1022","FCFP4_1024b1023","FCFP4_1024b1024","FCFP4_1024b103","FCFP4_1024b104","FCFP4_1024b105","FCFP4_1024b106","FCFP4_1024b107","FCFP4_1024b108","FCFP4_1024b109","FCFP4_1024b11","FCFP4_1024b110","FCFP4_1024b111","FCFP4_1024b112","FCFP4_1024b113","FCFP4_1024b114","FCFP4_1024b115","FCFP4_1024b116","pXC50"
{7 1,24 1,37 1,52 4.301}
{0 CHEMBL1214345,7 1,41 1,52 4.834}
{0 CHEMBL1240872,1 1,2 1,3 1,4 1,6 1,7 1,32 1,52 7.167}
{0 CHEMBL1240873,1 1,2 1,3 1,4 1,7 1,32 1,52 7.114}
{0 CHEMBL1240874,1 1,2 1,3 1,4 1,6 1,7 1,32 1,52 6.68}
{0 CHEMBL1240875,1 1,2 1,3 1,4 1,6 1,7 1,26 1,52 6.359}
{0 CHEMBL1240876,1 1,2 1,3 1,4 1,6 1,7 1,8 1,52 5.197}
{0 CHEMBL1242932,1 1,2 1,3 1,4 1,6 1,7 1,8 1,52 6.074}
{0 CHEMBL1242933,1 1,2 1,3 1,4 1,6 1,7 1,8 1,52 5.453}
{0 CHEMBL1242959,1 1,2 1,3 1,4 1,7 1,8 1,52 7.387}
{0 CHEMBL1242960,1 1,2 1,3 1,4 1,7 1,32 1,52 7.155}
{0 CHEMBL1242986,1 1,2 1,3 1,4 1,7 1,26 1,52 5.943}
{0 CHEMBL1242987,1 1,2 1,3 1,4 1,7 1,8 1,52 6.544}
{0 CHEMBL1270953,7 1,52 4.301}
{0 CHEMBL1299406,7 1,41 1,52 4.301}
{0 CHEMBL1299435,7 1,30 1,41 1,52 4.688}
{0 CHEMBL1299610,7 1,52 6.046}
{0 CHEMBL1299742,7 1,41 1,52 5.466}
{0 CHEMBL1300045,7 1,41 1,52 5.029}
{0 CHEMBL1300170,7 1,52 6.398}
{0 CHEMBL1300177,7 1,30 1,41 1,52 5.174}
{0 CHEMBL1300311,7 1,8 1,24 1,44 1,52 5.02}
{0 CHEMBL1300437,7 1,41 1,52 4.301}
{0 CHEMBL1301720,7 1,52 4.301}
{0 CHEMBL1301945,7 1,14 1,41 1,52 4.847}
{0 CHEMBL1302106,7 1,41 1,52 5.27}
{0 CHEMBL1302784,7 1,8 1,11 1,13 1,32 1,52 5.132}
{0 CHEMBL1303038,7 1,8 1,24 1,52 4.581}
{0 CHEMBL1303294,7 1,8 1,41 1,52 4.806}
{0 CHEMBL1303355,7 1,20 1,33 1,41 1,52 4.586}
{0 CHEMBL1303467,2 1,7 1,52 4.695}
{0 CHEMBL1303783,7 1,8 1,32 1,52 4.761}
{0 CHEMBL1303961,7 1,19 1,41 1,52 5.166}
{0 CHEMBL1304118,7 1,28 1,52 4.314}
{0 CHEMBL1304631,7 1,41 1,52 4.931}
{0 CHEMBL1304995,7 1,52 6.398}
{0 CHEMBL1305050,7 1,21 1,41 1,52 4.301}
{0 CHEMBL1305070,7 1,27 1,41 1,52 5.168}
{0 CHEMBL1305074,7 1,41 1,42 1,52 4.301}
{0 CHEMBL1305111,7 1,24 1,41 1,52 4.301}
{0 CHEMBL1305142,7 1,8 1,41 1,52 5.787}
{0 CHEMBL1305173,7 1,8 1,41 1,52 6.398}
{0 CHEMBL1305181,7 1,41 1,44 1,52 4.718}
{0 CHEMBL1305451,7 1,23 1,52 4.301}
{0 CHEMBL1305761,7 1,52 4.79}
{0 CHEMBL1306121,7 1,22 1,41 1,52 4.943}
{0 CHEMBL1306253,7 1,30 1,52 4.301}
{0 CHEMBL1306353,7 1,42 1,52 4.798}
{0 CHEMBL1306365,7 1,52 4.639}
{0 CHEMBL1306609,7 1,52 4.461}
{0 CHEMBL1306721,7 1,16 1,30 1,41 1,52 4.765}
{0 CHEMBL1307015,7 1,52 4.705}
{0 CHEMBL1307240,7 1,33 1,41 1,52 5.006}
{0 CHEMBL1307270,7 1,13 1,52 4.859}
{0 CHEMBL1307384,7 1,8 1,41 1,45 1,52 4.301}
{0 CHEMBL1307467,7 1,41 1,44 1,52 4.732}
{0 CHEMBL1307549,7 1,52 4.777}
{0 CHEMBL1307895,7 1,13 1,52 4.975}
{0 CHEMBL1308004,7 1,8 1,12 1,24 1,29 1,41 1,52 4.604}
{0 CHEMBL1308322,7 1,52 4.301}
{0 CHEMBL1308385,7 1,52 5.424}
{0 CHEMBL1308774,7 1,52 5.503}
{0 CHEMBL1309257,7 1,52 6.398}
{0 CHEMBL1309432,7 1,41 1,45 1,52 5.341}
{0 CHEMBL1309484,7 1,13 1,52 4.676}
{0 CHEMBL1309973,7 1,41 1,52 6.398}
{0 CHEMBL1310272,7 1,41 1,52 5.154}
{0 CHEMBL1310523,7 1,11 1,52 5.195}
{0 CHEMBL1310524,7 1,45 1,52 5.613}
{0 CHEMBL1310649,7 1,41 1,52 4.301}
{0 CHEMBL1310797,7 1,52 4.964}
{0 CHEMBL1310996,7 1,41 1,42 1,52 4.741}
{0 CHEMBL1311039,7 1,8 1,52 5.106}
{0 CHEMBL1311122,7 1,30 1,41 1,52 4.301}
{0 CHEMBL1311669,7 1,21 1,41 1,42 1,52 5.235}
{0 CHEMBL1311746,7 1,8 1,32 1,52 5.236}
{0 CHEMBL1311928,7 1,52 5.591}
{0 CHEMBL1312198,2 1,7 1,52 4.641}
{0 CHEMBL1312315,7 1,8 1,47 1,52 4.301}
{0 CHEMBL1312561,7 1,41 1,52 4.301}
{0 CHEMBL1312761,7 1,22 1,41 1,48 1,52 4.301}
{0 CHEMBL1312992,7 1,41 1,52 4.301}
{0 CHEMBL1313074,7 1,8 1,32 1,52 4.892}
{0 CHEMBL1313141,7 1,10 1,52 4.418}
{0 CHEMBL1313434,7 1,9 1,52 5.114}
{0 CHEMBL1313485,7 1,52 4.301}
{0 CHEMBL1313567,7 1,45 1,52 4.82}
{0 CHEMBL1313596,7 1,19 1,31 1,41 1,52 4.854}
{0 CHEMBL1313653,7 1,52 5.215}
{0 CHEMBL1314032,7 1,27 1,30 1,52 5.631}
{0 CHEMBL1319003,7 1,22 1,41 1,52 4.301}
{0 CHEMBL1319031,7 1,13 1,52 4.301}
{0 CHEMBL1319089,7 1,11 1,30 1,52 6.398}
{0 CHEMBL1319097,7 1,8 1,52 4.301}
{0 CHEMBL1319147,7 1,13 1,14 1,41 1,52 4.301}
{0 CHEMBL1319841,7 1,41 1,52 5.037}
{0 CHEMBL1319924,7 1,29 1,52 4.301}
{0 CHEMBL1320023,7 1,52 5.261}
{0 CHEMBL1320203,7 1,52 6.398}
{0 CHEMBL1320223,7 1,13 1,32 1,52 4.535}
{0 CHEMBL1320230,7 1,9 1,33 1,52 4.323}
{0 CHEMBL1320260,7 1,29 1,52 5.136}
{0 CHEMBL1320354,7 1,41 1,44 1,52 5.096}
{0 CHEMBL1320983,7 1,52 4.96}
{0 CHEMBL1321129,7 1,8 1,24 1,32 1,52 5.245}
{0 CHEMBL1321194,7 1,30 1,45 1,52 5.182}
{0 CHEMBL1321198,7 1,52 5.445}
{0 CHEMBL1321333,7 1,41 1,52 5.413}
{0 CHEMBL1321553,7 1,45 1,52 4.636}
{0 CHEMBL1321706,7 1,41 1,52 5.419}
{0 CHEMBL1321933,7 1,22 1,41 1,52 5.439}
{0 CHEMBL1322330,7 1,41 1,52 4.938}
{0 CHEMBL1322699,7 1,41 1,52 6.172}
{0 CHEMBL1322806,7 1,52 5.345}
{0 CHEMBL1323364,7 1,41 1,52 4.556}
{0 CHEMBL1323747,7 1,33 1,52 4.715}
{0 CHEMBL1323832,7 1,41 1,52 4.834}
{0 CHEMBL1323880,7 1,52 4.368}
{0 CHEMBL1324079,7 1,52 4.802}
{0 CHEMBL1324140,7 1,39 1,41 1,52 6.398}
{0 CHEMBL1324275,7 1,41 1,52 4.301}
{0 CHEMBL1324397,7 1,8 1,24 1,30 1,52 5.095}
{0 CHEMBL1324476,7 1,41 1,52 5.199}
{0 CHEMBL1324586,6 1,7 1,41 1,52 6.398}
{0 CHEMBL1325301,7 1,41 1,52 5.31}
{0 CHEMBL1326122,7 1,18 1,41 1,52 4.912}
{0 CHEMBL1326140,7 1,52 4.567}
{0 CHEMBL1326239,7 1,52 5.103}
{0 CHEMBL1326328,7 1,52 5.168}
{0 CHEMBL1326413,7 1,39 1,41 1,52 4.851}
{0 CHEMBL1326919,7 1,41 1,52 6.398}
{0 CHEMBL1327125,7 1,52 4.301}
{0 CHEMBL1327866,7 1,16 1,19 1,52 4.932}
{0 CHEMBL1327885,7 1,52 5.162}
{0 CHEMBL1328224,7 1,52 5.367}
{0 CHEMBL1329286,7 1,41 1,52 4.741}
{0 CHEMBL1330051,1 1,7 1,52 5.079}
{0 CHEMBL1330135,7 1,30 1,41 1,52 5.419}
{0 CHEMBL1330318,7 1,41 1,52 4.887}
{0 CHEMBL1330322,3 1,7 1,41 1,52 4.372}
{0 CHEMBL1330352,7 1,52 4.98}
{0 CHEMBL1330638,7 1,52 4.301}
{0 CHEMBL1331003,7 1,41 1,52 4.825}
{0 CHEMBL1331552,7 1,15 1,40 1,52 4.761}
{0 CHEMBL1331691,7 1,8 1,24 1,52 4.301}
{0 CHEMBL1332282,7 1,52 4.933}
{0 CHEMBL1332393,7 1,8 1,13 1,42 1,52 4.301}
{0 CHEMBL1332449,7 1,52 5.246}
{0 CHEMBL1332765,7 1,8 1,27 1,30 1,41 1,52 4.907}
{0 CHEMBL1333388,7 1,52 5.188}
{0 CHEMBL1333399,7 1,41 1,52 4.967}
{0 CHEMBL1333407,7 1,52 5.212}
{0 CHEMBL1333828,7 1,41 1,52 5.196}
{0 CHEMBL1334036,7 1,45 1,52 5.26}
{0 CHEMBL1334062,7 1,13 1,52 4.607}
{0 CHEMBL1335162,7 1,8 1,24 1,52 4.58}
{0 CHEMBL1335658,7 1,14 1,17 1,52 4.301}
{0 CHEMBL1336098,7 1,41 1,52 4.604}
{0 CHEMBL1336586,7 1,8 1,30 1,52 6.398}
{0 CHEMBL1336992,7 1,52 5.18}
{0 CHEMBL1337125,7 1,8 1,24 1,32 1,49 1,52 5.333}
{0 CHEMBL1337197,7 1,52 6.398}
{0 CHEMBL1337604,7 1,41 1,52 5.518}
{0 CHEMBL1338186,7 1,52 6.398}
{0 CHEMBL1338593,7 1,52 5.06}
{0 CHEMBL1339368,52 6.398}
{0 CHEMBL1339685,7 1,8 1,13 1,24 1,41 1,50 1,52 4.301}
{0 CHEMBL1339843,7 1,52 5.017}
{0 CHEMBL1340253,7 1,41 1,52 5.333}
{0 CHEMBL1340633,7 1,21 1,52 5.542}
{0 CHEMBL1341766,2 1,7 1,52 6.398}
{0 CHEMBL1341778,7 1,51 1,52 5.14}
{0 CHEMBL1341809,7 1,52 4.868}
{0 CHEMBL1341833,7 1,41 1,52 4.619}
{0 CHEMBL1342199,7 1,14 1,30 1,45 1,52 4.301}
{0 CHEMBL1342825,7 1,52 4.301}
{0 CHEMBL1343006,7 1,52 5.264}
{0 CHEMBL1343063,7 1,41 1,52 5.555}
{0 CHEMBL1343333,7 1,32 1,52 5.562}
{0 CHEMBL1343488,7 1,41 1,52 4.792}
{0 CHEMBL1343653,7 1,10 1,21 1,52 6.398}
{0 CHEMBL1343934,7 1,41 1,52 5.049}
{0 CHEMBL1344185,7 1,41 1,45 1,52 4.723}
{0 CHEMBL1344531,7 1,41 1,52 5.139}
{0 CHEMBL1344549,7 1,52 4.513}
{0 CHEMBL1344654,7 1,52 5.022}
{0 CHEMBL1344956,7 1,41 1,52 4.301}
{0 CHEMBL1344985,7 1,52 4.301}
{0 CHEMBL1345066,7 1,13 1,30 1,52 5.019}
{0 CHEMBL1345090,7 1,41 1,48 1,52 4.301}
{0 CHEMBL1345112,7 1,8 1,41 1,52 4.999}
{0 CHEMBL1345338,7 1,41 1,52 5.292}
{0 CHEMBL1345413,7 1,49 1,52 4.89}
{0 CHEMBL1345908,7 1,41 1,52 5.017}
{0 CHEMBL1345979,7 1,11 1,52 4.826}
{0 CHEMBL1346061,7 1,52 5.848}
{0 CHEMBL1346170,7 1,52 4.301}
{0 CHEMBL1346621,7 1,21 1,41 1,52 4.916}
{0 CHEMBL1346640,7 1,41 1,52 5.079}
{0 CHEMBL1347046,7 1,21 1,45 1,52 5.396}
{0 CHEMBL1347093,7 1,52 4.919}
{0 CHEMBL1347472,7 1,8 1,24 1,41 1,52 4.579}
{0 CHEMBL1347587,7 1,8 1,52 4.301}
{0 CHEMBL1347786,7 1,52 6.343}
{0 CHEMBL1347895,7 1,52 4.978}
{0 CHEMBL1347908,7 1,8 1,24 1,32 1,41 1,52 5.341}
{0 CHEMBL1348091,7 1,41 1,52 5.535}
{0 CHEMBL1348169,7 1,41 1,44 1,52 5.128}
{0 CHEMBL1348402,7 1,52 4.301}
{0 CHEMBL1348433,7 1,41 1,52 5.269}
{0 CHEMBL1348465,7 1,14 1,30 1,45 1,52 4.989}
{0 CHEMBL1349074,7 1,45 1,52 5.405}
{0 CHEMBL1349182,7 1,52 4.722}
{0 CHEMBL1349308,7 1,52 4.919}
{0 CHEMBL1349465,7 1,23 1,52 5.379}
{0 CHEMBL1349918,7 1,52 4.837}
{0 CHEMBL1350606,7 1,41 1,52 5.021}
{0 CHEMBL1350872,7 1,52 4.983}
{0 CHEMBL1351340,7 1,52 4.301}
{0 CHEMBL1351961,7 1,52 4.853}
{0 CHEMBL1351983,7 1,41 1,52 5.958}
{0 CHEMBL1352087,7 1,8 1,24 1,41 1,52 4.586}
{0 CHEMBL1352489,7 1,42 1,52 4.845}
{0 CHEMBL1352542,7 1,16 1,33 1,52 5.047}
{0 CHEMBL1352564,7 1,21 1,29 1,52 5.139}
{0 CHEMBL1352671,7 1,9 1,31 1,52 4.301}
{0 CHEMBL1352894,7 1,52 4.739}
{0 CHEMBL1353252,7 1,16 1,27 1,52 4.721}
{0 CHEMBL1353330,7 1,8 1,32 1,52 4.607}
{0 CHEMBL1353442,7 1,52 4.845}
{0 CHEMBL1353476,7 1,52 4.526}
{0 CHEMBL1353535,7 1,8 1,24 1,32 1,52 4.951}
{0 CHEMBL1358863,7 1,21 1,41 1,52 5.963}
{0 CHEMBL1359211,7 1,30 1,52 4.301}
{0 CHEMBL1359316,7 1,8 1,39 1,45 1,52 5.166}
{0 CHEMBL1359861,7 1,8 1,52 4.88}
{0 CHEMBL1359985,7 1,13 1,32 1,52 4.301}
{0 CHEMBL1360102,7 1,41 1,52 4.886}
{0 CHEMBL1360473,7 1,8 1,24 1,41 1,52 4.301}
{0 CHEMBL1360692,7 1,52 5.212}
{0 CHEMBL1360752,7 1,8 1,41 1,52 4.301}
{0 CHEMBL1360952,7 1,13 1,52 4.614}
{0 CHEMBL1360996,7 1,41 1,52 5.554}
{0 CHEMBL1361363,7 1,52 5.598}
{0 CHEMBL1361648,7 1,10 1,52 4.867}
{0 CHEMBL1362283,7 1,30 1,45 1,52 5.159}
{0 CHEMBL1362781,7 1,52 4.301}
{0 CHEMBL1362939,7 1,32 1,52 4.301}
{0 CHEMBL1363140,7 1,30 1,41 1,52 4.301}
{0 CHEMBL1363414,7 1,13 1,52 6.398}
{0 CHEMBL1364063,7 1,30 1,45 1,52 6.398}
{0 CHEMBL1364075,7 1,8 1,41 1,52 5.092}
{0 CHEMBL1364180,7 1,52 4.918}
{0 CHEMBL1364493,7 1,13 1,49 1,52 6.041}
{0 CHEMBL1365192,7 1,52 4.684}
{0 CHEMBL1365262,7 1,9 1,41 1,44 1,52 5.114}
{0 CHEMBL1365398,7 1,52 4.301}
{0 CHEMBL1365559,7 1,30 1,45 1,52 4.301}
{0 CHEMBL1365650,7 1,8 1,24 1,30 1,52 4.535}
{0 CHEMBL1366188,7 1,45 1,52 5.139}
{0 CHEMBL1366209,7 1,41 1,52 6.038}
{0 CHEMBL1366367,7 1,52 4.956}
{0 CHEMBL1366913,7 1,52 4.301}
{0 CHEMBL1367285,7 1,52 4.301}
{0 CHEMBL1367830,7 1,13 1,49 1,52 5.399}
{0 CHEMBL1368038,7 1,52 5.41}
{0 CHEMBL1369125,7 1,41 1,49 1,52 5.223}
{0 CHEMBL1369185,7 1,52 5.512}
{0 CHEMBL1370165,7 1,21 1,41 1,52 4.301}
{0 CHEMBL1370250,7 1,30 1,41 1,52 4.907}
{0 CHEMBL1370340,7 1,8 1,41 1,52 4.301}
{0 CHEMBL1370379,7 1,52 4.301}
{0 CHEMBL1370398,7 1,8 1,10 1,52 5.477}
{0 CHEMBL1371411,7 1,41 1,52 4.598}
{0 CHEMBL1371842,7 1,52 5.109}
{0 CHEMBL1372586,7 1,52 4.301}
{0 CHEMBL1372818,7 1,41 1,52 4.301}
{0 CHEMBL1372826,7 1,52 4.301}
{0 CHEMBL1372839,7 1,29 1,30 1,41 1,52 6.398}
{0 CHEMBL1372911,7 1,41 1,52 5.487}
{0 CHEMBL1372933,7 1,52 5.031}
{0 CHEMBL1373142,7 1,8 1,41 1,52 4.564}
{0 CHEMBL1373194,7 1,17 1,52 4.301}
{0 CHEMBL1373474,52 5.549}
{0 CHEMBL1373569,7 1,8 1,52 5.883}
{0 CHEMBL1373845,7 1,32 1,52 4.592}
{0 CHEMBL1373946,7 1,41 1,52 4.467}
{0 CHEMBL1374511,7 1,41 1,52 5.136}
{0 CHEMBL1374583,7 1,52 4.301}
{0 CHEMBL1374821,7 1,52 4.301}
{0 CHEMBL1374838,7 1,41 1,52 5.481}
{0 CHEMBL1375153,7 1,52 5.122}
{0 CHEMBL1375293,7 1,52 5.059}
{0 CHEMBL1376048,7 1,52 4.301}
{0 CHEMBL1376556,7 1,52 5.321}
{0 CHEMBL1377485,7 1,52 5.241}
{0 CHEMBL1377510,7 1,8 1,52 4.842}
{0 CHEMBL1377693,7 1,41 1,52 4.318}
{0 CHEMBL1378300,7 1,52 5.788}
{0 CHEMBL1378549,7 1,41 1,52 5.239}
{0 CHEMBL1378652,7 1,49 1,52 4.918}
{0 CHEMBL1379125,7 1,52 4.301}
{0 CHEMBL1379203,7 1,8 1,12 1,32 1,52 5.3}
{0 CHEMBL1379369,7 1,52 4.994}
{0 CHEMBL1379556,7 1,8 1,52 4.301}
{0 CHEMBL1379983,7 1,41 1,52 4.748}
{0 CHEMBL1380673,7 1,13 1,52 4.38}
{0 CHEMBL1380796,7 1,30 1,41 1,52 4.301}
{0 CHEMBL1381242,7 1,52 5.241}
{0 CHEMBL1381852,7 1,41 1,45 1,52 5.04}
{0 CHEMBL1382299,7 1,52 5.133}
{0 CHEMBL1382379,7 1,52 4.662}
{0 CHEMBL1382623,7 1,52 5.846}
{0 CHEMBL1382924,7 1,52 5.953}
{0 CHEMBL1383033,2 1,7 1,52 4.788}
{0 CHEMBL1383481,7 1,41 1,52 4.425}
{0 CHEMBL1383741,7 1,52 4.301}
{0 CHEMBL1383938,7 1,39 1,52 4.441}
{0 CHEMBL1384216,7 1,52 5.217}
{0 CHEMBL1384697,7 1,41 1,52 4.743}
{0 CHEMBL1384988,7 1,13 1,32 1,41 1,52 4.301}
{0 CHEMBL1385264,7 1,52 5.981}
{0 CHEMBL1385286,7 1,13 1,24 1,45 1,52 4.529}
{0 CHEMBL1385370,7 1,52 4.528}
{0 CHEMBL1385374,7 1,41 1,45 1,52 5.982}
{0 CHEMBL1385608,7 1,52 4.92}
{0 CHEMBL1385676,3 1,7 1,52 4.931}
{0 CHEMBL1386247,7 1,45 1,52 4.73}
{0 CHEMBL1386259,7 1,42 1,52 4.752}
{0 CHEMBL1386270,7 1,52 4.436}
{0 CHEMBL1386784,7 1,52 5.551}
{0 CHEMBL1387044,7 1,52 4.967}
{0 CHEMBL1387074,7 1,41 1,52 4.301}
{0 CHEMBL1387189,7 1,41 1,52 4.621}
{0 CHEMBL1387491,7 1,41 1,52 4.301}
{0 CHEMBL1387664,7 1,8 1,52 4.301}
{0 CHEMBL1387951,7 1,21 1,52 5.623}
{0 CHEMBL1388030,7 1,41 1,52 4.301}
{0 CHEMBL1388358,2 1,7 1,52 4.46}
{0 CHEMBL1388691,7 1,41 1,52 4.301}
{0 CHEMBL1389109,7 1,41 1,52 5.474}
{0 CHEMBL1389118,7 1,8 1,41 1,52 4.301}
{0 CHEMBL1389650,3 1,7 1,52 4.966}
{0 CHEMBL1389841,7 1,41 1,52 4.301}
{0 CHEMBL1390602,7 1,17 1,37 1,52 4.923}
{0 CHEMBL1390634,7 1,30 1,45 1,52 6.398}
{0 CHEMBL1391211,7 1,52 4.517}
{0 CHEMBL1391519,7 1,8 1,41 1,51 1,52 5.004}
{0 CHEMBL1391545,7 1,8 1,36 1,52 5.053}
{0 CHEMBL1391726,7 1,41 1,52 6.398}
{0 CHEMBL1391757,7 1,52 4.725}
{0 CHEMBL1391764,7 1,13 1,32 1,52 4.912}
{0 CHEMBL1391789,7 1,13 1,32 1,52 6.398}
{0 CHEMBL1391856,7 1,8 1,41 1,52 4.301}
{0 CHEMBL1392089,7 1,13 1,30 1,32 1,52 4.796}
{0 CHEMBL1392441,7 1,41 1,52 4.827}
{0 CHEMBL1392453,7 1,45 1,52 6.398}
{0 CHEMBL1392636,7 1,17 1,37 1,52 4.956}
{0 CHEMBL1392785,7 1,30 1,52 4.851}
{0 CHEMBL1392970,7 1,8 1,32 1,37 1,52 6.398}
{0 CHEMBL1393264,7 1,29 1,52 4.301}
{0 CHEMBL1393352,7 1,41 1,52 4.301}
{0 CHEMBL1393523,7 1,16 1,41 1,52 4.693}
{0 CHEMBL1393609,7 1,13 1,24 1,52 6.031}
{0 CHEMBL1393686,7 1,30 1,45 1,52 5.656}
{0 CHEMBL1393819,7 1,13 1,30 1,52 5.02}
{0 CHEMBL1393901,7 1,52 4.301}
{0 CHEMBL1393942,7 1,8 1,51 1,52 6.398}
{0 CHEMBL1394030,7 1,52 5.391}
{0 CHEMBL1394043,7 1,10 1,12 1,30 1,52 5.521}
{0 CHEMBL1399167,7 1,41 1,52 5.131}
{0 CHEMBL1399250,7 1,8 1,41 1,52 4.84}
{0 CHEMBL1399543,52 4.301}
{0 CHEMBL1399773,7 1,52 4.301}
{0 CHEMBL1399891,7 1,49 1,52 4.977}
{0 CHEMBL1399944,7 1,41 1,52 4.301}
{0 CHEMBL1399997,7 1,42 1,52 4.301}
{0 CHEMBL1400345,7 1,52 6.398}
{0 CHEMBL1400950,7 1,52 4.836}
{0 CHEMBL1401534,7 1,52 4.889}
{0 CHEMBL1401655,7 1,8 1,24 1,52 5.427}
{0 CHEMBL1401890,7 1,24 1,41 1,52 4.301}
{0 CHEMBL1402020,7 1,11 1,16 1,30 1,41 1,52 4.301}
{0 CHEMBL1402287,7 1,41 1,52 6.398}
{0 CHEMBL1402382,7 1,46 1,52 5.38}
{0 CHEMBL1402737,7 1,52 4.301}
{0 CHEMBL1402812,7 1,8 1,26 1,41 1,52 5.363}
{0 CHEMBL1402848,7 1,51 1,52 5.006}
{0 CHEMBL1403307,2 1,7 1,52 4.301}
{0 CHEMBL140425,52 4.301}
{0 CHEMBL1404580,7 1,42 1,52 6.398}
{0 CHEMBL1404786,7 1,8 1,24 1,41 1,52 5.761}
{0 CHEMBL1404792,7 1,31 1,52 4.301}
{0 CHEMBL1404979,7 1,52 5.314}
{0 CHEMBL1405615,7 1,52 4.736}
{0 CHEMBL1405705,7 1,52 4.843}
{0 CHEMBL1406387,7 1,21 1,41 1,52 5.329}
{0 CHEMBL1407173,7 1,41 1,52 5.206}
{0 CHEMBL1408029,7 1,27 1,41 1,52 4.985}
{0 CHEMBL1408575,7 1,11 1,13 1,52 4.998}
{0 CHEMBL1408704,7 1,13 1,29 1,52 4.318}
{0 CHEMBL1408764,7 1,30 1,52 4.634}
{0 CHEMBL1409329,7 1,41 1,52 5.642}
{0 CHEMBL1409497,7 1,52 5.687}
{0 CHEMBL1409926,4 1,7 1,18 1,52 4.83}
{0 CHEMBL1409968,7 1,41 1,52 4.302}
{0 CHEMBL1410085,7 1,41 1,52 4.301}
{0 CHEMBL1410228,7 1,41 1,52 4.863}
{0 CHEMBL1410479,7 1,41 1,52 5.74}
{0 CHEMBL1410498,7 1,9 1,14 1,41 1,52 4.781}
{0 CHEMBL1410745,7 1,32 1,52 5.608}
{0 CHEMBL1411391,7 1,41 1,52 5.22}
{0 CHEMBL1411626,7 1,21 1,30 1,45 1,52 5.518}
{0 CHEMBL1411821,7 1,42 1,52 6.398}
{0 CHEMBL1412007,7 1,41 1,42 1,52 4.765}
{0 CHEMBL1412104,7 1,41 1,52 5.499}
{0 CHEMBL1412113,7 1,9 1,26 1,41 1,52 5.727}
{0 CHEMBL1412218,7 1,52 4.803}
{0 CHEMBL1412616,7 1,52 4.301}
{0 CHEMBL1413523,7 1,30 1,51 1,52 5.041}
{0 CHEMBL1413766,7 1,39 1,52 4.301}
{0 CHEMBL1413854,7 1,9 1,29 1,41 1,49 1,52 6.048}
{0 CHEMBL1414078,7 1,8 1,52 4.729}
{0 CHEMBL1414508,7 1,8 1,24 1,41 1,52 5.846}
{0 CHEMBL1414761,7 1,45 1,52 5.026}
{0 CHEMBL1414867,7 1,26 1,41 1,52 5.261}
{0 CHEMBL1416104,7 1,29 1,51 1,52 5.272}
{0 CHEMBL1416319,7 1,30 1,52 4.301}
{0 CHEMBL1416439,7 1,9 1,33 1,52 5.082}
{0 CHEMBL1416607,7 1,52 4.609}
{0 CHEMBL1416682,7 1,52 5.528}
{0 CHEMBL1416972,7 1,41 1,52 5.016}
{0 CHEMBL1416995,7 1,41 1,52 5.174}
{0 CHEMBL1417524,7 1,41 1,52 5.571}
{0 CHEMBL1417708,7 1,41 1,52 4.605}
{0 CHEMBL1418192,7 1,52 5.218}
{0 CHEMBL1418962,7 1,52 6.398}
{0 CHEMBL1418997,7 1,49 1,52 4.334}
{0 CHEMBL1419291,7 1,45 1,46 1,52 4.964}
{0 CHEMBL1419498,7 1,14 1,41 1,52 5.023}
{0 CHEMBL1419617,7 1,41 1,52 4.945}
{0 CHEMBL1420004,7 1,8 1,52 4.839}
{0 CHEMBL1420034,7 1,14 1,52 4.799}
{0 CHEMBL1420122,7 1,41 1,52 6.398}
{0 CHEMBL1420418,7 1,52 4.301}
{0 CHEMBL1420812,7 1,52 4.301}
{0 CHEMBL1420838,7 1,52 5.027}
{0 CHEMBL1420875,7 1,52 5.348}
{0 CHEMBL1420908,7 1,13 1,32 1,52 5.124}
{0 CHEMBL1420932,7 1,49 1,52 5.177}
{0 CHEMBL1421033,7 1,21 1,52 4.899}
{0 CHEMBL1421187,7 1,10 1,52 4.995}
{0 CHEMBL1421191,7 1,26 1,40 1,41 1,52 6.398}
{0 CHEMBL1421317,7 1,41 1,52 5.477}
{0 CHEMBL1421432,7 1,8 1,12 1,41 1,52 4.473}
{0 CHEMBL1421559,7 1,52 6.398}
{0 CHEMBL1421574,7 1,41 1,52 6.398}
{0 CHEMBL1421903,3 1,7 1,52 4.575}
{0 CHEMBL1422225,7 1,21 1,29 1,41 1,52 4.675}
{0 CHEMBL1422254,7 1,32 1,52 5.152}
{0 CHEMBL1422845,7 1,41 1,52 5.012}
{0 CHEMBL1423304,7 1,29 1,52 5.227}
{0 CHEMBL1423574,7 1,8 1,41 1,52 4.301}
{0 CHEMBL1423724,7 1,41 1,52 5.144}
{0 CHEMBL1423872,7 1,52 4.793}
{0 CHEMBL1424500,7 1,52 5.032}
{0 CHEMBL1424585,7 1,41 1,52 4.59}
{0 CHEMBL1424748,7 1,26 1,45 1,52 4.301}
{0 CHEMBL1424755,7 1,9 1,17 1,52 4.301}
{0 CHEMBL1424971,7 1,34 1,45 1,49 1,52 4.301}
{0 CHEMBL1425268,7 1,52 5.407}
{0 CHEMBL1425914,7 1,52 4.301}
{0 CHEMBL1426157,7 1,41 1,52 5.062}
{0 CHEMBL1426240,7 1,52 5.331}
{0 CHEMBL1426364,7 1,8 1,29 1,52 4.301}
{0 CHEMBL1426552,7 1,52 4.954}
{0 CHEMBL1426782,7 1,52 4.6}
{0 CHEMBL1426817,7 1,8 1,32 1,52 5.207}
{0 CHEMBL1426862,7 1,41 1,52 4.682}
{0 CHEMBL1426955,7 1,8 1,52 5.514}
{0 CHEMBL1427233,7 1,41 1,52 4.871}
{0 CHEMBL1427458,7 1,52 4.301}
{0 CHEMBL1427736,7 1,41 1,52 4.618}
{0 CHEMBL1427748,7 1,52 6.143}
{0 CHEMBL1427793,7 1,52 5.438}
{0 CHEMBL1427822,7 1,8 1,30 1,32 1,52 4.941}
{0 CHEMBL1427968,7 1,8 1,32 1,52 5.104}
{0 CHEMBL1428174,7 1,36 1,52 4.301}
{0 CHEMBL1428261,7 1,52 4.873}
{0 CHEMBL1428699,7 1,41 1,52 4.301}
{0 CHEMBL1429036,7 1,30 1,41 1,52 5.745}
{0 CHEMBL1429225,7 1,52 6.398}
{0 CHEMBL1429396,7 1,29 1,52 4.301}
{0 CHEMBL1429703,7 1,41 1,52 5.232}
{0 CHEMBL1430430,7 1,9 1,30 1,52 5.471}
{0 CHEMBL1430876,7 1,34 1,41 1,45 1,49 1,52 4.793}
{0 CHEMBL1431286,3 1,7 1,40 1,41 1,52 4.786}
{0 CHEMBL1431524,7 1,52 5.046}
{0 CHEMBL1432044,7 1,41 1,52 4.301}
{0 CHEMBL1432374,7 1,27 1,29 1,52 4.667}
{0 CHEMBL1433040,7 1,41 1,52 4.825}
{0 CHEMBL1433052,7 1,41 1,52 5.801}
{0 CHEMBL1433125,7 1,21 1,41 1,52 5.581}
{0 CHEMBL1433227,7 1,9 1,32 1,41 1,52 5.103}
{0 CHEMBL1437613,7 1,8 1,24 1,52 4.487}
{0 CHEMBL1438178,7 1,13 1,17 1,50 1,52 5.257}
{0 CHEMBL1438267,7 1,32 1,41 1,52 4.513}
{0 CHEMBL1438381,7 1,30 1,41 1,52 4.943}
{0 CHEMBL1438738,7 1,8 1,21 1,29 1,30 1,41 1,52 4.901}
{0 CHEMBL1438899,7 1,52 6.289}
{0 CHEMBL1438936,7 1,52 4.998}
{0 CHEMBL1438937,7 1,52 4.301}
{0 CHEMBL1438983,7 1,34 1,43 1,49 1,52 4.944}
{0 CHEMBL1439185,7 1,15 1,52 5.992}
{0 CHEMBL1439846,7 1,52 5.036}
{0 CHEMBL1440185,7 1,45 1,52 4.301}
{0 CHEMBL1440418,7 1,52 5.656}
{0 CHEMBL1440452,7 1,52 5.349}
{0 CHEMBL1440481,7 1,52 4.707}
{0 CHEMBL1440502,7 1,51 1,52 4.413}
{0 CHEMBL1440918,7 1,52 4.569}
{0 CHEMBL1441131,7 1,52 5.665}
{0 CHEMBL1441211,7 1,41 1,52 4.307}
{0 CHEMBL1441807,7 1,32 1,41 1,44 1,45 1,52 4.726}
{0 CHEMBL1441855,7 1,41 1,52 4.301}
{0 CHEMBL1442309,7 1,52 5.331}
{0 CHEMBL1442487,7 1,41 1,52 6.398}
{0 CHEMBL1443192,7 1,41 1,52 5.198}
{0 CHEMBL1443380,7 1,8 1,52 4.301}
{0 CHEMBL1443834,7 1,13 1,49 1,52 5.17}
{0 CHEMBL1444178,10 1,32 1,52 4.512}
{0 CHEMBL1444355,4 1,6 1,7 1,41 1,52 5.274}
{0 CHEMBL1444883,7 1,51 1,52 5.312}
{0 CHEMBL1445163,7 1,41 1,52 4.613}
{0 CHEMBL1445720,7 1,21 1,41 1,45 1,46 1,52 4.301}
{0 CHEMBL1446306,7 1,52 5.342}
{0 CHEMBL1446344,7 1,41 1,52 6.398}
{0 CHEMBL1446629,7 1,39 1,41 1,52 5.788}
{0 CHEMBL1446695,7 1,52 4.301}
{0 CHEMBL1446705,7 1,52 4.656}
{0 CHEMBL1447492,7 1,41 1,52 5.926}
{0 CHEMBL1447496,7 1,41 1,52 5.232}
{0 CHEMBL1447883,7 1,41 1,52 4.556}
{0 CHEMBL1448074,7 1,8 1,24 1,52 4.629}
{0 CHEMBL1448378,7 1,30 1,41 1,52 5.166}
{0 CHEMBL1448495,7 1,52 4.301}
{0 CHEMBL1448592,7 1,13 1,52 4.944}
{0 CHEMBL1448795,7 1,8 1,24 1,52 5.184}
{0 CHEMBL1448876,7 1,52 6.038}
{0 CHEMBL1448881,7 1,52 4.911}
{0 CHEMBL1448911,7 1,17 1,30 1,52 5.204}
{0 CHEMBL1449290,7 1,26 1,30 1,52 4.714}
{0 CHEMBL1449325,7 1,41 1,52 4.908}
{0 CHEMBL1449771,7 1,30 1,45 1,52 4.847}
{0 CHEMBL1450043,7 1,29 1,36 1,52 5.672}
{0 CHEMBL1450480,7 1,45 1,52 5.152}
{0 CHEMBL1451147,7 1,41 1,52 6.398}
{0 CHEMBL1451598,7 1,41 1,52 6.398}
{0 CHEMBL1452182,2 1,7 1,39 1,52 4.541}
{0 CHEMBL1452537,7 1,39 1,41 1,52 5.162}
{0 CHEMBL1452872,7 1,8 1,12 1,41 1,52 6.099}
{0 CHEMBL1453148,7 1,30 1,41 1,52 4.809}
{0 CHEMBL1453574,7 1,52 5.702}
{0 CHEMBL1453859,7 1,41 1,52 4.301}
{0 CHEMBL1454500,7 1,15 1,26 1,41 1,52 5.396}
{0 CHEMBL1454616,7 1,52 4.301}
{0 CHEMBL1454798,7 1,9 1,41 1,52 5.288}
{0 CHEMBL1455733,7 1,41 1,52 4.702}
{0 CHEMBL1456517,7 1,41 1,52 4.647}
{0 CHEMBL1456765,7 1,41 1,52 6.398}
{0 CHEMBL1457015,7 1,41 1,52 4.301}
{0 CHEMBL1457753,7 1,8 1,24 1,52 4.941}
{0 CHEMBL1457905,7 1,41 1,52 5.21}
{0 CHEMBL1458074,7 1,41 1,52 4.874}
{0 CHEMBL1458440,7 1,10 1,36 1,52 5.165}
{0 CHEMBL1458448,7 1,9 1,52 4.874}
{0 CHEMBL1458609,7 1,41 1,52 4.301}
{0 CHEMBL1458713,1 1,2 1,3 1,7 1,52 4.301}
{0 CHEMBL1458909,7 1,52 5.009}
{0 CHEMBL1459147,7 1,30 1,31 1,41 1,52 5.402}
{0 CHEMBL1459407,7 1,8 1,24 1,52 4.301}
{0 CHEMBL1459936,7 1,8 1,41 1,52 6.398}
{0 CHEMBL1460134,7 1,8 1,52 5.106}
{0 CHEMBL1460258,7 1,52 4.301}
{0 CHEMBL1460265,7 1,13 1,52 4.301}
{0 CHEMBL1460334,7 1,23 1,41 1,52 5.74}
{0 CHEMBL1460500,7 1,8 1,52 4.301}
{0 CHEMBL1461694,7 1,8 1,24 1,32 1,39 1,52 4.301}
{0 CHEMBL1461701,4 1,6 1,7 1,39 1,52 6.398}
{0 CHEMBL1462265,7 1,49 1,52 4.561}
{0 CHEMBL1462418,7 1,41 1,52 4.387}
{0 CHEMBL1462559,7 1,52 4.829}
{0 CHEMBL1462609,7 1,30 1,52 5.203}
{0 CHEMBL1462662,2 1,7 1,42 1,52 4.56}
{0 CHEMBL1463050,7 1,52 4.301}
{0 CHEMBL1463051,7 1,41 1,52 5.625}
{0 CHEMBL1463333,7 1,42 1,52 5.149}
{0 CHEMBL1463403,2 1,7 1,52 6.398}
{0 CHEMBL1463422,7 1,41 1,52 5.309}
{0 CHEMBL1463505,7 1,30 1,45 1,52 4.458}
{0 CHEMBL1463795,7 1,8 1,12 1,45 1,52 4.858}
{0 CHEMBL1464644,7 1,52 5.409}
{0 CHEMBL1464902,7 1,29 1,52 4.301}
{0 CHEMBL1465581,7 1,41 1,52 5.002}
{0 CHEMBL1465721,7 1,41 1,52 4.784}
{0 CHEMBL1466115,7 1,52 4.965}
{0 CHEMBL1466293,7 1,8 1,52 5.39}
{0 CHEMBL1466307,7 1,30 1,52 4.965}
{0 CHEMBL1466714,7 1,52 4.873}
{0 CHEMBL1466774,7 1,37 1,52 4.603}
{0 CHEMBL1466789,7 1,52 5.447}
{0 CHEMBL1467097,7 1,8 1,52 4.625}
{0 CHEMBL1467250,7 1,29 1,52 5.113}
{0 CHEMBL1467356,7 1,52 5.059}
{0 CHEMBL1467604,7 1,11 1,13 1,16 1,49 1,52 4.612}
{0 CHEMBL1467721,7 1,39 1,41 1,52 4.301}
{0 CHEMBL1468165,7 1,52 5.371}
{0 CHEMBL1468246,7 1,52 4.897}
{0 CHEMBL1468799,7 1,8 1,24 1,32 1,52 6.398}
{0 CHEMBL1468851,2 1,7 1,47 1,52 4.349}
{0 CHEMBL1468968,7 1,8 1,10 1,52 5.112}
{0 CHEMBL1469542,7 1,42 1,52 5.271}
{0 CHEMBL1469637,7 1,41 1,52 5.012}
{0 CHEMBL1469653,7 1,9 1,26 1,41 1,52 5.388}
{0 CHEMBL1469659,7 1,37 1,40 1,52 5.584}
{0 CHEMBL1469710,7 1,16 1,45 1,52 4.962}
{0 CHEMBL1469847,7 1,30 1,52 4.807}
{0 CHEMBL1470581,7 1,8 1,52 5.081}
{0 CHEMBL1470612,7 1,42 1,52 4.301}
{0 CHEMBL1470835,7 1,41 1,52 5.51}
{0 CHEMBL1471083,7 1,52 5.49}
{0 CHEMBL1471276,7 1,52 4.301}
{0 CHEMBL1471907,7 1,52 4.873}
{0 CHEMBL1472587,7 1,30 1,52 4.73}
{0 CHEMBL1477203,7 1,44 1,52 4.582}
{0 CHEMBL1477421,7 1,30 1,52 4.301}
{0 CHEMBL1477723,7 1,41 1,52 6.353}
{0 CHEMBL1477778,7 1,10 1,52 4.932}
{0 CHEMBL1477932,7 1,8 1,52 5.022}
{0 CHEMBL1478054,7 1,41 1,52 4.971}
{0 CHEMBL1478587,7 1,27 1,52 5.427}
{0 CHEMBL1478752,7 1,14 1,52 4.6}
{0 CHEMBL1478950,7 1,8 1,24 1,31 1,41 1,52 5.005}
{0 CHEMBL1478990,7 1,30 1,45 1,52 5.136}
{0 CHEMBL1479229,7 1,29 1,52 4.518}
{0 CHEMBL1479240,7 1,30 1,41 1,52 4.301}
{0 CHEMBL1479490,2 1,7 1,52 4.301}
{0 CHEMBL1479543,7 1,52 5.099}
{0 CHEMBL1479567,7 1,18 1,23 1,41 1,52 4.931}
{0 CHEMBL1479745,7 1,41 1,52 4.477}
{0 CHEMBL1479812,7 1,8 1,32 1,52 6.398}
{0 CHEMBL1480192,7 1,41 1,52 4.815}
{0 CHEMBL1480237,7 1,52 6.398}
{0 CHEMBL1480465,7 1,49 1,52 5.24}
{0 CHEMBL1481083,7 1,41 1,52 5.008}
{0 CHEMBL1481347,7 1,45 1,52 5.173}
{0 CHEMBL1481370,7 1,52 4.301}
{0 CHEMBL1481613,7 1,41 1,52 4.301}
{0 CHEMBL1482172,7 1,8 1,32 1,52 4.301}
{0 CHEMBL1482431,7 1,52 5.476}
{0 CHEMBL1482453,7 1,32 1,52 6.135}
{0 CHEMBL1482585,7 1,8 1,24 1,41 1,52 5.348}
{0 CHEMBL1482614,7 1,41 1,52 4.652}
{0 CHEMBL1482773,7 1,41 1,52 5.128}
{0 CHEMBL1482875,7 1,52 4.301}
{0 CHEMBL1482885,7 1,31 1,39 1,41 1,52 6.398}
{0 CHEMBL1483192,7 1,41 1,52 5.821}
{0 CHEMBL1483613,7 1,30 1,52 4.899}
{0 CHEMBL1483756,7 1,52 4.31}
{0 CHEMBL1484050,7 1,52 4.658}
{0 CHEMBL1484171,7 1,41 1,52 4.885}
{0 CHEMBL1484311,7 1,41 1,52 4.301}
{0 CHEMBL1484489,7 1,52 4.301}
{0 CHEMBL1484741,7 1,52 5.228}
{0 CHEMBL1484937,7 1,13 1,52 4.741}
{0 CHEMBL1485351,7 1,12 1,16 1,52 4.301}
{0 CHEMBL1485525,7 1,8 1,41 1,52 6.132}
{0 CHEMBL1486319,7 1,8 1,32 1,52 5.267}
{0 CHEMBL1486351,7 1,41 1,52 5.002}
{0 CHEMBL1486562,7 1,41 1,52 4.301}
{0 CHEMBL1486737,7 1,52 6.398}
{0 CHEMBL1486748,7 1,8 1,24 1,41 1,52 4.967}
{0 CHEMBL1486883,2 1,7 1,52 4.936}
{0 CHEMBL1487337,7 1,32 1,52 5.496}
{0 CHEMBL1487973,7 1,41 1,52 5.429}
{0 CHEMBL1488012,7 1,52 4.301}
{0 CHEMBL1488035,7 1,13 1,52 5.214}
{0 CHEMBL1488150,7 1,52 5.043}
{0 CHEMBL1488340,7 1,41 1,52 4.647}
{0 CHEMBL1488837,7 1,41 1,52 5.053}
{0 CHEMBL1489457,7 1,52 4.733}
{0 CHEMBL1489923,7 1,13 1,52 4.301}
{0 CHEMBL1489924,7 1,52 4.841}
{0 CHEMBL1490119,7 1,52 4.301}
{0 CHEMBL1490423,7 1,9 1,41 1,52 5.672}
{0 CHEMBL1490435,7 1,41 1,52 4.777}
{0 CHEMBL1490642,7 1,41 1,52 5.066}
{0 CHEMBL1491387,7 1,41 1,52 4.301}
{0 CHEMBL1491400,7 1,41 1,52 4.753}
{0 CHEMBL1491916,7 1,52 5.544}
{0 CHEMBL1493047,7 1,52 5.249}
{0 CHEMBL1493506,7 1,41 1,52 4.586}
{0 CHEMBL1493575,7 1,52 4.902}
{0 CHEMBL1493628,1 1,7 1,8 1,24 1,52 4.826}
{0 CHEMBL1493898,7 1,52 4.301}
{0 CHEMBL1493953,7 1,19 1,41 1,52 5.101}
{0 CHEMBL1494107,7 1,22 1,41 1,52 4.301}
{0 CHEMBL1494578,7 1,52 4.301}
{0 CHEMBL1495216,7 1,8 1,41 1,51 1,52 5.168}
{0 CHEMBL1495238,7 1,52 5.464}
{0 CHEMBL1495740,7 1,29 1,44 1,45 1,51 1,52 5.297}
{0 CHEMBL1496143,3 1,7 1,52 5.41}
{0 CHEMBL1496707,7 1,30 1,52 4.301}
{0 CHEMBL1496874,7 1,42 1,52 4.711}
{0 CHEMBL1497597,7 1,52 4.477}
{0 CHEMBL1497753,7 1,52 5.111}
{0 CHEMBL1498136,6 1,52 5.456}
{0 CHEMBL1498210,7 1,8 1,12 1,45 1,52 4.514}
{0 CHEMBL1498224,7 1,52 4.981}
{0 CHEMBL1498854,7 1,41 1,52 4.301}
{0 CHEMBL1499012,7 1,37 1,52 4.301}
{0 CHEMBL1499048,7 1,8 1,41 1,52 5.648}
{0 CHEMBL1499210,7 1,8 1,41 1,52 5.308}
{0 CHEMBL1499282,7 1,52 5.413}
{0 CHEMBL1500619,7 1,37 1,52 4.917}
{0 CHEMBL1500908,7 1,41 1,52 5.219}
{0 CHEMBL1501050,7 1,52 4.818}
{0 CHEMBL1501666,6 1,7 1,29 1,41 1,52 4.988}
{0 CHEMBL1502002,7 1,52 4.722}
{0 CHEMBL1502209,7 1,52 6.398}
{0 CHEMBL1502223,2 1,7 1,52 4.301}
{0 CHEMBL1502867,7 1,8 1,24 1,41 1,52 5.578}
{0 CHEMBL1502873,7 1,52 4.778}
{0 CHEMBL1502943,7 1,30 1,33 1,41 1,52 4.964}
{0 CHEMBL1503012,7 1,41 1,52 4.76}
{0 CHEMBL1503103,7 1,52 4.301}
{0 CHEMBL1503307,7 1,10 1,52 4.301}
{0 CHEMBL1503432,7 1,9 1,41 1,52 4.584}
{0 CHEMBL1503643,7 1,13 1,32 1,52 4.809}
{0 CHEMBL1504063,7 1,8 1,32 1,52 5.301}
{0 CHEMBL1504066,32 1,52 4.301}
{0 CHEMBL1504323,7 1,52 4.365}
{0 CHEMBL1504385,7 1,27 1,52 5.957}
{0 CHEMBL1504960,7 1,30 1,52 5.303}
{0 CHEMBL1505159,7 1,13 1,32 1,52 4.301}
{0 CHEMBL1506129,7 1,8 1,37 1,52 5.642}
{0 CHEMBL1506141,7 1,41 1,52 4.301}
{0 CHEMBL1506708,7 1,8 1,52 5.514}
{0 CHEMBL1506889,7 1,8 1,29 1,52 5.75}
{0 CHEMBL1506934,7 1,33 1,52 4.301}
{0 CHEMBL1507497,7 1,41 1,52 4.943}
{0 CHEMBL1507621,7 1,41 1,52 5.166}
{0 CHEMBL1507874,7 1,13 1,30 1,32 1,52 5.045}
{0 CHEMBL1508220,7 1,41 1,52 5.635}
{0 CHEMBL1508351,7 1,40 1,52 4.925}
{0 CHEMBL1508791,7 1,11 1,52 4.767}
{0 CHEMBL1509077,7 1,52 4.301}
{0 CHEMBL1509141,7 1,41 1,52 4.301}
{0 CHEMBL1509354,7 1,36 1,41 1,52 4.301}
{0 CHEMBL1509367,7 1,21 1,41 1,42 1,52 4.301}
{0 CHEMBL1509378,7 1,41 1,52 5.165}
{0 CHEMBL1509530,7 1,52 5.49}
{0 CHEMBL1509537,7 1,52 5.217}
{0 CHEMBL1509703,7 1,13 1,39 1,41 1,52 4.606}
{0 CHEMBL1509715,7 1,8 1,52 4.717}
{0 CHEMBL1509990,7 1,8 1,24 1,52 5.102}
{0 CHEMBL1510161,7 1,8 1,52 4.301}
{0 CHEMBL1510260,7 1,16 1,45 1,52 4.301}
{0 CHEMBL1511282,7 1,52 6.398}
{0 CHEMBL1511432,7 1,8 1,24 1,41 1,52 5.623}
{0 CHEMBL1516491,7 1,8 1,37 1,52 4.301}
{0 CHEMBL1517660,7 1,24 1,30 1,52 4.301}
{0 CHEMBL1517677,7 1,8 1,24 1,41 1,52 5.274}
{0 CHEMBL1517776,7 1,41 1,52 5.652}
{0 CHEMBL1517782,7 1,8 1,32 1,41 1,48 1,52 4.508}
{0 CHEMBL1517815,7 1,52 4.901}
{0 CHEMBL1517892,7 1,41 1,52 4.766}
{0 CHEMBL1518193,7 1,41 1,52 5.846}
{0 CHEMBL1518625,7 1,45 1,52 5.109}
{0 CHEMBL1519241,2 1,7 1,41 1,52 4.734}
{0 CHEMBL1519259,7 1,32 1,52 5.068}
{0 CHEMBL1519276,7 1,33 1,41 1,52 4.301}
{0 CHEMBL1519367,7 1,52 5.319}
{0 CHEMBL1519498,7 1,41 1,52 5.046}
{0 CHEMBL1519862,7 1,30 1,41 1,52 5.525}
{0 CHEMBL1519930,7 1,45 1,52 4.881}
{0 CHEMBL1520240,7 1,52 5.588}
{0 CHEMBL1520323,7 1,41 1,52 4.522}
{0 CHEMBL1521078,7 1,8 1,41 1,52 6.184}
{0 CHEMBL1521244,7 1,18 1,35 1,52 4.899}
{0 CHEMBL1522084,7 1,41 1,45 1,52 4.989}
{0 CHEMBL1522659,7 1,8 1,41 1,52 4.386}
{0 CHEMBL1522695,7 1,52 5.172}
{0 CHEMBL1522704,7 1,21 1,52 4.301}
{0 CHEMBL1522943,7 1,12 1,52 4.847}
{0 CHEMBL1523020,7 1,52 5.228}
{0 CHEMBL1523527,7 1,41 1,52 4.301}
{0 CHEMBL1523608,7 1,41 1,52 5.091}
{0 CHEMBL1523891,7 1,52 4.301}
{0 CHEMBL1524203,7 1,41 1,52 5.294}
{0 CHEMBL1525017,7 1,52 5.126}
{0 CHEMBL1525030,7 1,52 4.301}
{0 CHEMBL1525318,7 1,31 1,52 5.007}
{0 CHEMBL1525340,7 1,41 1,52 4.859}
{0 CHEMBL1526081,7 1,51 1,52 4.824}
{0 CHEMBL1526192,7 1,52 4.925}
{0 CHEMBL1526421,7 1,41 1,42 1,52 4.301}
{0 CHEMBL1526612,2 1,7 1,52 5.152}
{0 CHEMBL1526819,7 1,41 1,52 6.044}
{0 CHEMBL1526946,7 1,8 1,12 1,36 1,41 1,52 4.617}
{0 CHEMBL1526993,7 1,41 1,52 4.899}
{0 CHEMBL1527057,7 1,8 1,32 1,52 4.754}
{0 CHEMBL1527598,7 1,41 1,52 5.249}
{0 CHEMBL1528570,7 1,8 1,31 1,52 5.228}
{0 CHEMBL1528593,7 1,41 1,52 5.605}
{0 CHEMBL1528647,7 1,41 1,52 6.11}
{0 CHEMBL1529354,7 1,13 1,41 1,52 5.049}
{0 CHEMBL1529364,7 1,8 1,52 4.333}
{0 CHEMBL1529826,7 1,14 1,52 4.301}
{0 CHEMBL1530636,7 1,51 1,52 4.535}
{0 CHEMBL1530733,7 1,27 1,31 1,52 4.988}
{0 CHEMBL1531389,7 1,51 1,52 6.095}
{0 CHEMBL1532819,7 1,52 6.216}
{0 CHEMBL1532844,7 1,8 1,43 1,52 5.128}
{0 CHEMBL1533240,7 1,43 1,52 4.301}
{0 CHEMBL1533555,7 1,8 1,41 1,52 4.301}
{0 CHEMBL1533708,7 1,52 4.816}
{0 CHEMBL1534118,7 1,41 1,49 1,52 5.126}
{0 CHEMBL1534195,7 1,29 1,52 5.282}
{0 CHEMBL1534310,7 1,8 1,41 1,44 1,52 5.242}
{0 CHEMBL1534430,7 1,13 1,50 1,52 4.883}
{0 CHEMBL1534596,7 1,41 1,52 4.301}
{0 CHEMBL1534904,7 1,51 1,52 5.397}
{0 CHEMBL1535185,7 1,8 1,24 1,41 1,52 5.482}
{0 CHEMBL1535246,7 1,21 1,30 1,45 1,52 4.301}
{0 CHEMBL1535318,7 1,51 1,52 4.844}
{0 CHEMBL1535791,7 1,30 1,52 4.456}
{0 CHEMBL1536348,7 1,41 1,52 5.437}
{0 CHEMBL1536448,7 1,29 1,52 5.179}
{0 CHEMBL1536734,7 1,9 1,30 1,52 5.156}
{0 CHEMBL1537428,7 1,52 5.619}
{0 CHEMBL1537789,7 1,8 1,51 1,52 4.465}
{0 CHEMBL1537995,7 1,52 4.932}
{0 CHEMBL1538011,7 1,41 1,52 5.635}
{0 CHEMBL1538066,3 1,7 1,52 5.281}
{0 CHEMBL1538210,7 1,41 1,52 5.349}
{0 CHEMBL1538715,7 1,52 4.961}
{0 CHEMBL1538838,7 1,30 1,41 1,45 1,52 4.869}
{0 CHEMBL1539019,7 1,32 1,52 6.271}
{0 CHEMBL1539224,7 1,9 1,52 4.87}
{0 CHEMBL1540064,7 1,10 1,41 1,52 4.301}
{0 CHEMBL1541109,7 1,23 1,52 5.021}
{0 CHEMBL1541315,7 1,52 4.796}
{0 CHEMBL1541336,7 1,41 1,52 4.857}
{0 CHEMBL1541366,7 1,8 1,52 4.845}
{0 CHEMBL1541672,7 1,52 5.278}
{0 CHEMBL1541807,7 1,9 1,26 1,41 1,52 5.546}
{0 CHEMBL1541861,7 1,49 1,52 4.609}
{0 CHEMBL1542196,7 1,8 1,52 4.922}
{0 CHEMBL1542282,7 1,13 1,52 4.301}
{0 CHEMBL1542491,7 1,32 1,41 1,52 5.23}
{0 CHEMBL1542578,7 1,38 1,52 5.78}
{0 CHEMBL1542885,7 1,8 1,24 1,32 1,52 4.682}
{0 CHEMBL1543272,7 1,24 1,30 1,52 4.808}
{0 CHEMBL1543349,7 1,41 1,52 5.473}
{0 CHEMBL1543504,7 1,8 1,30 1,52 4.845}
{0 CHEMBL1543659,7 1,29 1,37 1,41 1,52 5.145}
{0 CHEMBL1543801,7 1,41 1,52 5.109}
{0 CHEMBL1543893,7 1,25 1,52 4.968}
{0 CHEMBL1544057,7 1,52 4.301}
{0 CHEMBL1544334,7 1,14 1,41 1,52 4.301}
{0 CHEMBL1544637,7 1,41 1,52 4.912}
{0 CHEMBL1544648,7 1,41 1,52 4.301}
{0 CHEMBL1544798,7 1,8 1,52 5.511}
{0 CHEMBL1545049,7 1,41 1,52 5.114}
{0 CHEMBL1545341,7 1,29 1,52 4.6}
{0 CHEMBL1545385,7 1,30 1,41 1,52 5.147}
{0 CHEMBL1545483,7 1,52 4.359}
{0 CHEMBL1546518,7 1,41 1,52 5.029}
{0 CHEMBL1546524,7 1,41 1,52 4.763}
{0 CHEMBL1546610,7 1,18 1,25 1,52 5.33}
{0 CHEMBL1547996,7 1,52 4.727}
{0 CHEMBL1548067,7 1,52 5.165}
{0 CHEMBL1548408,7 1,52 5.322}
{0 CHEMBL1548475,7 1,52 5.646}
{0 CHEMBL1548833,7 1,52 4.301}
{0 CHEMBL1548948,7 1,8 1,41 1,52 5.306}
{0 CHEMBL1549266,7 1,8 1,12 1,24 1,52 5.36}
{0 CHEMBL1549455,7 1,33 1,52 4.301}
{0 CHEMBL1549513,7 1,8 1,12 1,52 5.143}
{0 CHEMBL1549791,7 1,31 1,41 1,52 5.524}
{0 CHEMBL1549845,7 1,52 5.052}
{0 CHEMBL1550024,7 1,52 4.727}
{0 CHEMBL1550387,7 1,26 1,41 1,52 5.638}
{0 CHEMBL1550769,7 1,30 1,45 1,52 5.457}
{0 CHEMBL1555805,7 1,32 1,52 4.799}
{0 CHEMBL1556074,7 1,8 1,24 1,41 1,52 4.301}
{0 CHEMBL1556603,7 1,8 1,24 1,52 5.149}
{0 CHEMBL1557120,7 1,52 5.548}
{0 CHEMBL1557159,7 1,52 5.192}
{0 CHEMBL1557622,7 1,41 1,52 4.301}
{0 CHEMBL1558584,7 1,52 5.152}
{0 CHEMBL1558692,7 1,8 1,32 1,36 1,52 6.398}
{0 CHEMBL1559099,7 1,8 1,24 1,52 4.64}
{0 CHEMBL1559301,7 1,41 1,52 5.383}
{0 CHEMBL1559545,7 1,41 1,52 5.066}
{0 CHEMBL1559796,7 1,11 1,41 1,52 4.974}
{0 CHEMBL1561001,7 1,8 1,18 1,52 4.301}
{0 CHEMBL1561879,7 1,14 1,41 1,52 4.833}
{0 CHEMBL1561893,7 1,52 5.12}
{0 CHEMBL1562771,7 1,14 1,52 4.637}
{0 CHEMBL1563013,7 1,8 1,24 1,52 4.984}
{0 CHEMBL1563043,7 1,41 1,52 5.047}
{0 CHEMBL1563896,7 1,52 4.876}
{0 CHEMBL1564012,7 1,52 4.92}
{0 CHEMBL1564502,7 1,52 6.398}
{0 CHEMBL1564523,3 1,7 1,52 5.31}
{0 CHEMBL1564814,7 1,52 5.017}
{0 CHEMBL1565396,7 1,30 1,39 1,52 4.972}
{0 CHEMBL1565737,7 1,37 1,52 5.122}
{0 CHEMBL1565768,7 1,41 1,52 4.759}
{0 CHEMBL1565820,7 1,52 4.618}
{0 CHEMBL1566345,7 1,8 1,41 1,51 1,52 5.398}
{0 CHEMBL1566511,7 1,14 1,41 1,52 6.398}
{0 CHEMBL1567097,7 1,10 1,14 1,52 4.301}
{0 CHEMBL1567371,7 1,30 1,41 1,52 4.301}
{0 CHEMBL1567389,7 1,9 1,41 1,52 5.093}
{0 CHEMBL1567424,7 1,32 1,52 4.301}
{0 CHEMBL1567780,7 1,52 5.081}
{0 CHEMBL1568020,7 1,41 1,52 4.699}
{0 CHEMBL1568109,7 1,21 1,36 1,52 5.133}
{0 CHEMBL1568131,7 1,52 4.301}
{0 CHEMBL1569124,7 1,47 1,52 4.301}
{0 CHEMBL1569503,7 1,8 1,24 1,52 5.584}
{0 CHEMBL1569566,7 1,52 5.211}
{0 CHEMBL1569720,7 1,52 4.301}
{0 CHEMBL1569932,7 1,41 1,52 4.895}
{0 CHEMBL1571370,7 1,41 1,52 4.301}
{0 CHEMBL1571756,7 1,29 1,41 1,44 1,52 4.669}
{0 CHEMBL1571859,7 1,41 1,52 5.16}
{0 CHEMBL1571923,7 1,52 4.301}
{0 CHEMBL1572080,7 1,8 1,12 1,36 1,41 1,52 4.645}
{0 CHEMBL1572329,7 1,12 1,42 1,52 4.877}
{0 CHEMBL1573123,7 1,24 1,52 5.799}
{0 CHEMBL1574490,7 1,32 1,52 4.301}
{0 CHEMBL1574619,7 1,41 1,52 4.301}
{0 CHEMBL1575076,7 1,29 1,49 1,52 5.074}
{0 CHEMBL1575091,7 1,45 1,46 1,52 4.338}
{0 CHEMBL1575502,7 1,31 1,52 4.784}
{0 CHEMBL1576055,7 1,41 1,52 4.301}
{0 CHEMBL1576377,7 1,52 4.97}
{0 CHEMBL1576436,7 1,52 4.752}
{0 CHEMBL1576635,7 1,21 1,45 1,52 6.398}
{0 CHEMBL1576971,7 1,52 4.301}
{0 CHEMBL1577373,7 1,8 1,41 1,52 5.413}
{0 CHEMBL1577694,7 1,8 1,41 1,52 4.876}
{0 CHEMBL1577769,7 1,52 5.503}
{0 CHEMBL1578120,7 1,30 1,52 4.781}
{0 CHEMBL1578499,7 1,8 1,9 1,52 5.348}
{0 CHEMBL1578542,7 1,26 1,52 4.301}
{0 CHEMBL1578592,7 1,27 1,52 5.39}
{0 CHEMBL1578664,7 1,32 1,52 5.141}
{0 CHEMBL1578946,7 1,52 4.301}
{0 CHEMBL1578997,7 1,21 1,41 1,52 4.967}
{0 CHEMBL1579063,7 1,52 5.385}
{0 CHEMBL1579489,7 1,8 1,30 1,41 1,52 4.301}
{0 CHEMBL1579617,7 1,52 4.301}
{0 CHEMBL1580299,2 1,7 1,8 1,32 1,52 5.131}
{0 CHEMBL1580302,7 1,21 1,45 1,52 4.942}
{0 CHEMBL1580526,7 1,41 1,52 4.599}
{0 CHEMBL1580660,7 1,33 1,41 1,52 5.301}
{0 CHEMBL1580686,7 1,41 1,52 5.049}
{0 CHEMBL1580709,7 1,41 1,45 1,52 5.289}
{0 CHEMBL1580816,7 1,30 1,41 1,52 4.864}
{0 CHEMBL1580965,7 1,41 1,52 4.936}
{0 CHEMBL1580998,7 1,30 1,52 5.227}
{0 CHEMBL1581214,7 1,8 1,41 1,52 4.301}
{0 CHEMBL1581556,7 1,41 1,52 4.301}
{0 CHEMBL1581677,7 1,52 6.398}
{0 CHEMBL1581708,7 1,52 4.955}
{0 CHEMBL1581911,7 1,8 1,52 4.301}
{0 CHEMBL1581949,7 1,41 1,44 1,52 4.301}
{0 CHEMBL1582222,7 1,41 1,52 4.453}
{0 CHEMBL1582544,7 1,41 1,52 4.942}
{0 CHEMBL1582703,7 1,39 1,52 5.178}
{0 CHEMBL1582910,7 1,8 1,52 5.418}
{0 CHEMBL1583674,7 1,13 1,30 1,32 1,37 1,52 6.175}
{0 CHEMBL1583712,7 1,19 1,31 1,41 1,52 5.173}
{0 CHEMBL1583886,7 1,41 1,52 4.301}
{0 CHEMBL1584221,7 1,13 1,50 1,52 4.301}
{0 CHEMBL1584337,7 1,13 1,52 4.946}
{0 CHEMBL1584519,7 1,37 1,41 1,52 4.301}
{0 CHEMBL1584716,7 1,8 1,41 1,52 4.619}
{0 CHEMBL1584720,7 1,10 1,52 5.101}
{0 CHEMBL1584754,41 1,52 5.799}
{0 CHEMBL1584988,7 1,13 1,52 4.643}
{0 CHEMBL1585017,7 1,41 1,52 4.955}
{0 CHEMBL1585260,7 1,43 1,52 5.152}
{0 CHEMBL1585551,7 1,32 1,52 5.593}
{0 CHEMBL1585648,7 1,52 4.339}
{0 CHEMBL1585735,7 1,52 4.899}
{0 CHEMBL1585749,7 1,31 1,41 1,52 5.06}
{0 CHEMBL1585890,7 1,49 1,52 5.357}
{0 CHEMBL1586817,7 1,10 1,52 4.708}
{0 CHEMBL1587437,7 1,8 1,41 1,52 4.587}
{0 CHEMBL1587645,7 1,8 1,52 4.464}
{0 CHEMBL1588034,7 1,41 1,44 1,52 5.182}
{0 CHEMBL1588062,7 1,41 1,52 4.301}
{0 CHEMBL1588345,7 1,8 1,29 1,41 1,52 6.398}
{0 CHEMBL1588465,7 1,41 1,44 1,52 5.35}
{0 CHEMBL1588585,7 1,41 1,45 1,52 4.301}
{0 CHEMBL1588902,7 1,52 4.301}
{0 CHEMBL1589345,7 1,52 4.301}
{0 CHEMBL1589484,7 1,30 1,45 1,47 1,52 5.222}
{0 CHEMBL1589544,7 1,52 4.959}
{0 CHEMBL1594456,7 1,27 1,52 4.717}
{0 CHEMBL1594527,7 1,41 1,52 5.023}
{0 CHEMBL1594883,7 1,41 1,52 4.301}
{0 CHEMBL1595065,2 1,7 1,52 4.884}
{0 CHEMBL1595277,7 1,22 1,45 1,52 5.092}
{0 CHEMBL1595646,7 1,45 1,52 5.407}
{0 CHEMBL1595774,7 1,30 1,52 4.301}
{0 CHEMBL1595855,4 1,7 1,52 5.468}
{0 CHEMBL1596681,7 1,45 1,52 5.144}
{0 CHEMBL1596696,7 1,8 1,52 4.301}
{0 CHEMBL1596715,7 1,30 1,42 1,52 4.803}
{0 CHEMBL1597060,7 1,52 5.323}
{0 CHEMBL1598043,52 4.941}
{0 CHEMBL1598247,7 1,8 1,52 4.316}
{0 CHEMBL1598464,7 1,52 5.364}
{0 CHEMBL1598605,7 1,52 5.367}
{0 CHEMBL1598713,7 1,52 5.193}
{0 CHEMBL1598721,7 1,8 1,52 4.719}
{0 CHEMBL1599032,7 1,52 4.301}
{0 CHEMBL1599628,7 1,41 1,52 4.349}
{0 CHEMBL1600056,7 1,52 5.046}
{0 CHEMBL1600183,7 1,41 1,44 1,52 4.974}
{0 CHEMBL1600299,7 1,41 1,52 5.091}
{0 CHEMBL1600422,7 1,32 1,41 1,44 1,52 4.301}
{0 CHEMBL1600754,7 1,41 1,52 4.353}
{0 CHEMBL1600820,7 1,41 1,52 5.14}
{0 CHEMBL1601327,7 1,41 1,52 4.301}
{0 CHEMBL1601383,7 1,42 1,52 4.301}
{0 CHEMBL1601863,7 1,48 1,52 5.146}
{0 CHEMBL1602581,7 1,32 1,52 4.876}
{0 CHEMBL1603194,7 1,8 1,41 1,52 4.301}
{0 CHEMBL1603478,7 1,41 1,44 1,52 4.746}
{0 CHEMBL1603693,7 1,13 1,32 1,52 5.054}
{0 CHEMBL1603948,7 1,52 4.301}
{0 CHEMBL1604091,7 1,13 1,29 1,30 1,42 1,52 5.036}
{0 CHEMBL1604170,7 1,21 1,41 1,52 4.301}
{0 CHEMBL1604393,7 1,52 6.398}
{0 CHEMBL1604568,7 1,13 1,52 5.487}
{0 CHEMBL1604694,7 1,52 5.069}
{0 CHEMBL1604971,7 1,41 1,52 5.179}
{0 CHEMBL1605254,7 1,20 1,52 4.301}
{0 CHEMBL1605350,7 1,30 1,41 1,52 5.29}
{0 CHEMBL1605568,7 1,8 1,41 1,52 5.243}
{0 CHEMBL1605642,7 1,41 1,52 5.693}
{0 CHEMBL1605677,7 1,52 4.301}
{0 CHEMBL1605788,7 1,27 1,52 5.601}
{0 CHEMBL1605811,7 1,52 5.118}
{0 CHEMBL1606087,7 1,45 1,52 5.866}
{0 CHEMBL1606479,7 1,41 1,52 4.301}
{0 CHEMBL1607489,7 1,37 1,41 1,52 4.732}
{0 CHEMBL1607656,7 1,52 4.301}
{0 CHEMBL1607676,7 1,41 1,52 4.93}
{0 CHEMBL1607709,7 1,13 1,41 1,52 5.073}
{0 CHEMBL1607855,3 1,7 1,10 1,13 1,52 4.553}
{0 CHEMBL1608186,7 1,41 1,52 5.093}
{0 CHEMBL1608597,7 1,52 4.616}
{0 CHEMBL1608778,7 1,19 1,25 1,30 1,52 5.492}
{0 CHEMBL1608861,7 1,14 1,52 4.406}
{0 CHEMBL1609569,2 1,7 1,52 5.642}
{0 CHEMBL1609786,2 1,7 1,51 1,52 5.497}
{0 CHEMBL1609883,7 1,29 1,52 4.81}
{0 CHEMBL1610117,7 1,32 1,52 4.301}
{0 CHEMBL1610299,7 1,41 1,52 4.301}
{0 CHEMBL1610438,7 1,41 1,52 4.597}
{0 CHEMBL1610519,7 1,20 1,21 1,41 1,42 1,52 4.868}
{0 CHEMBL1610610,7 1,52 4.488}
{0 CHEMBL1611338,2 1,7 1,52 4.962}
{0 CHEMBL1611622,7 1,52 5.196}
{0 CHEMBL1611650,7 1,8 1,45 1,52 4.655}
{0 CHEMBL1612095,7 1,41 1,52 4.794}
{0 CHEMBL1612190,7 1,52 4.301}
{0 CHEMBL1612529,7 1,9 1,52 4.301}
{0 CHEMBL1612956,7 1,24 1,41 1,52 4.301}
{0 CHEMBL1613288,2 1,7 1,52 4.301}
{0 CHEMBL1613404,7 1,52 5.054}
{0 CHEMBL1613616,7 1,52 5.28}
{0 CHEMBL1613675,7 1,45 1,52 5.33}
{0 CHEMBL165418,7 1,52 4.301}
{0 CHEMBL1964891,7 1,8 1,21 1,41 1,52 5.442}
{0 CHEMBL1968859,7 1,52 4.301}
{0 CHEMBL1972249,7 1,41 1,52 5.293}
{0 CHEMBL1974348,7 1,52 4.301}
{0 CHEMBL1975809,7 1,9 1,30 1,45 1,52 4.964}
{0 CHEMBL1976777,7 1,8 1,13 1,30 1,41 1,52 4.301}
{0 CHEMBL1978791,7 1,9 1,52 5.241}
{0 CHEMBL1979047,7 1,24 1,30 1,52 4.437}
{0 CHEMBL1979957,7 1,13 1,52 4.411}
{0 CHEMBL1980384,7 1,30 1,45 1,52 4.301}
{0 CHEMBL1980399,7 1,30 1,45 1,52 5.179}
{0 CHEMBL1985073,7 1,52 4.951}
{0 CHEMBL1986741,7 1,52 5.019}
{0 CHEMBL1987343,7 1,45 1,46 1,52 5.076}
{0 CHEMBL1994510,7 1,21 1,30 1,45 1,52 5.295}
{0 CHEMBL1996589,7 1,45 1,52 4.692}
{0 CHEMBL1998281,7 1,52 5.506}
{0 CHEMBL1998379,7 1,13 1,42 1,52 4.883}
{0 CHEMBL2000230,7 1,13 1,32 1,41 1,46 1,52 4.301}
{0 CHEMBL2000847,7 1,13 1,30 1,32 1,52 5.12}
{0 CHEMBL2001381,7 1,45 1,52 5.287}
{0 CHEMBL2001396,7 1,12 1,21 1,30 1,33 1,45 1,52 4.658}
{0 CHEMBL2002223,7 1,37 1,52 5.102}
{0 CHEMBL2004918,7 1,52 5.163}
{0 CHEMBL2005973,7 1,21 1,30 1,52 4.301}
{0 CHEMBL206737,1 1,2 1,3 1,7 1,8 1,52 4}
{0 CHEMBL207440,1 1,2 1,3 1,5 1,7 1,41 1,52 6.721}
{0 CHEMBL208986,1 1,2 1,5 1,7 1,41 1,52 5.77}
{0 CHEMBL209274,1 1,2 1,3 1,5 1,7 1,8 1,41 1,52 6.77}
{0 CHEMBL209286,1 1,2 1,3 1,5 1,7 1,41 1,52 6.602}
{0 CHEMBL209457,1 1,2 1,3 1,4 1,7 1,52 7.678}
{0 CHEMBL209736,1 1,2 1,5 1,7 1,52 5.585}
{0 CHEMBL210347,1 1,2 1,3 1,5 1,7 1,8 1,41 1,52 6.921}
{0 CHEMBL211200,1 1,2 1,3 1,5 1,7 1,41 1,52 6.721}
{0 CHEMBL212314,7 1,41 1,52 4.912}
{0 CHEMBL233347,7 1,41 1,52 4.85}
{0 CHEMBL256202,7 1,8 1,41 1,52 4.726}
{0 CHEMBL259516,7 1,52 4.301}
{0 CHEMBL261953,1 1,2 1,3 1,5 1,7 1,41 1,52 6.469}
{0 CHEMBL277535,7 1,52 4.833}
{0 CHEMBL288365,1 1,2 1,3 1,7 1,52 7.209}
{0 CHEMBL290106,52 5.323}
{0 CHEMBL340416,7 1,41 1,45 1,52 4.301}
{0 CHEMBL347731,2 1,3 1,7 1,52 4.377}
{0 CHEMBL373784,7 1,41 1,52 4.301}
{0 CHEMBL377197,1 1,2 1,5 1,7 1,41 1,52 5.721}
{0 CHEMBL378215,1 1,2 1,3 1,5 1,7 1,41 1,52 6.77}
{0 CHEMBL378465,1 1,2 1,3 1,5 1,7 1,41 1,52 6.699}
{0 CHEMBL379402,1 1,2 1,3 1,5 1,7 1,52 6.62}
{0 CHEMBL388590,7 1,15 1,52 5.205}
{0 CHEMBL455277,1 1,2 1,3 1,4 1,6 1,7 1,52 6.721}
{0 CHEMBL473251,1 1,2 1,3 1,4 1,6 1,7 1,52 6.77}
{0 CHEMBL474786,7 1,41 1,42 1,52 4.935}
{0 CHEMBL475920,1 1,2 1,3 1,4 1,6 1,7 1,52 7.004}
{0 CHEMBL478222,1 1,2 1,3 1,4 1,6 1,7 1,52 7}
{0 CHEMBL496,7 1,52 5.428}
{0 CHEMBL510279,7 1,52 5.301}
{0 CHEMBL516123,1 1,2 1,3 1,4 1,6 1,7 1,52 6.921}
{0 CHEMBL533602,7 1,8 1,27 1,52 5.169}
{0 CHEMBL536166,7 1,45 1,52 4.777}
{0 CHEMBL547483,7 1,8 1,27 1,52 4.301}
{0 CHEMBL579424,7 1,8 1,32 1,41 1,52 5.407}
{0 CHEMBL605959,7 1,8 1,21 1,30 1,41 1,52 4.863}
{0 CHEMBL63440,1 1,2 1,3 1,7 1,44 1,52 5.751}
{0 CHEMBL81935,7 1,52 5.106}
{0 CHEMBL84010,7 1,41 1,52 5.21}
