"molecule_id","AMW","C.","pXC50"
{1 8.013,2 26.7,3 4.367}
{0 CHEMBL1088461,1 7.854,2 28.2,3 2.757}
{0 CHEMBL141272,1 9.844,2 30.8,3 4.105}
{0 CHEMBL1430,1 7.462,2 25,3 4.301}
{0 CHEMBL1560,1 7.494,2 31,3 5.611}
{0 CHEMBL207222,1 7.462,2 25,3 4.863}
{0 CHEMBL21485,1 7.621,2 37.5,3 4.245}
{0 CHEMBL263376,1 8.458,2 38.9,3 4}
{0 CHEMBL291888,1 9.638,2 43.8,3 4.469}
{0 CHEMBL434965,1 7.494,2 31,3 4.377}
