{
  "data_set_description": {
    "collection_date": "November 2013",
    "creator": "Dr Jeremy Besnard, Dr Ivan Olier, Dr Noureddin Sadawi, Dr Larisa Soldatova, Dr Crina Grosan, Prof Ross King, Dr Richard Bickerton, Prof Andrew Hopkins and Dr Willem van Hoorn",
    "default_target_attribute": "pXC50",
    "description": "This dataset contains QSAR data (from ChEMBL version 17) showing activity values (unit is pseudo-pCI50) of several compounds on drug target ChEMBL_ID: CHEMBL5700 (TID: 101505), and it has 15 rows and 1158 features (not including molecule IDs and class feature: molecule_id and pXC50). The features represent Molecular Descriptors which were generated from SMILES strings. Missing value imputation was applied to this dataset (By choosing the Median).",
    "description_version": "1",
    "file_id": "3620669",
    "format": "ARFF",
    "id": "37732",
    "licence": "Public",
    "md5_checksum": "9916e1f5f36ae1f84fe1e4df49df402f",
    "minio_url": "https://data.openml.org/datasets/0003/37732/dataset_37732.pq",
    "name": "QSAR-DATASET-FOR-DRUG-TARGET-CHEMBL5700",
    "original_data_url": "https://www.ebi.ac.uk/chembl/target/inspect/CHEMBL5700",
    "parquet_url": "https://data.openml.org/datasets/0003/37732/dataset_37732.pq",
    "processing_date": "2018-10-04 05:37:49",
    "row_id_attribute": "molecule_id",
    "status": "deactivated",
    "tag": [
      "MetaQSAR",
      "study_13"
    ],
    "upload_date": "2016-07-16T01:40:26",
    "url": "https://api.openml.org/data/v1/download/3620669/QSAR-DATASET-FOR-DRUG-TARGET-CHEMBL5700.arff",
    "version": "12",
    "visibility": "public"
  }
}