"molecule_id","Mi","N.","nHM","AMW","pXC50"
{1 1.12,2 9.4,3 1,4 9.951,5 5.499}
{0 CHEMBL115444,1 1.124,2 6,3 1,4 8.598,5 5.983}
{0 CHEMBL1651236,1 1.125,2 5.5,4 7.409,5 8.74}
{0 CHEMBL1672410,1 1.128,2 6.3,4 6.662,5 4.602}
{0 CHEMBL1672411,1 1.126,2 7.2,4 6.95,5 5.252}
{0 CHEMBL1672412,1 1.114,2 6.4,3 1,4 8.491,5 5.658}
{0 CHEMBL1672413,1 1.117,2 5.7,3 1,4 8.115,5 6.509}
{0 CHEMBL1672414,1 1.115,2 6,3 1,4 8.293,5 6}
{0 CHEMBL1672415,1 1.118,2 5.5,3 1,4 7.954,5 6.678}
{0 CHEMBL1672418,1 1.11,2 4.3,3 1,4 9.66,5 6.208}
{0 CHEMBL1794855,1 1.135,2 6.3,4 5.947,5 5}
{0 CHEMBL1817978,1 1.124,2 4.3,4 7.966,5 8.924}
{0 CHEMBL209821,1 1.139,2 5.8,3 1,4 6.532,5 5.699}
{0 CHEMBL231225,1 1.148,2 8.9,4 7.92,5 5.301}
{0 CHEMBL250699,1 1.112,2 2.4,3 1,4 8.727,5 5.699}
{0 CHEMBL251953,1 1.115,2 4.3,3 1,4 7.672,5 8.347}
{0 CHEMBL253596,1 1.112,2 2,4 7.662,5 8.854}
{0 CHEMBL253597,1 1.117,2 4.3,4 7.575,5 8.607}
{0 CHEMBL286346,1 1.109,2 6.1,3 2,4 9.673,5 8.222}
{0 CHEMBL401000,1 1.122,2 2,4 7.754,5 9.616}
{0 CHEMBL401258,1 1.106,2 5.4,4 8.172,5 5.699}
{0 CHEMBL426317,1 1.142,2 9.3,4 6.917,5 5}
{0 CHEMBL473435,1 1.122,2 2,4 7.754,5 9.001}
{0 CHEMBL481537,1 1.115,2 4.3,3 1,4 7.672,5 8.62}
{0 CHEMBL517539,1 1.121,2 8.5,3 1,4 8.402,5 8.456}
{0 CHEMBL63064,1 1.122,2 2,4 7.754,5 9.671}
{0 CHEMBL63154,1 1.131,2 2.9,4 6.329,5 8.398}
