{
  "data_set_description": {
    "collection_date": "November 2013",
    "creator": "Dr Jeremy Besnard, Dr Ivan Olier, Dr Noureddin Sadawi, Dr Larisa Soldatova, Dr Crina Grosan, Prof Ross King, Dr Richard Bickerton, Prof Andrew Hopkins and Dr Willem van Hoorn",
    "default_target_attribute": "pXC50",
    "description": "This dataset contains QSAR data (from ChEMBL version 17) showing activity values (unit is pseudo-pCI50) of several compounds on drug target ChEMBL_ID: CHEMBL3855 (TID: 10149), and it has 64 rows and 1159 features (not including molecule IDs and class feature: molecule_id and pXC50). The features represent Molecular Descriptors which were generated from SMILES strings. Missing value imputation was applied to this dataset (By choosing the Median).",
    "description_version": "1",
    "file_id": "3620151",
    "format": "ARFF",
    "id": "37708",
    "licence": "Public",
    "md5_checksum": "eba1aa70f23346dbfc99684609be3cf4",
    "minio_url": "https://data.openml.org/datasets/0003/37708/dataset_37708.pq",
    "name": "QSAR-DATASET-FOR-DRUG-TARGET-CHEMBL3855",
    "original_data_url": "https://www.ebi.ac.uk/chembl/target/inspect/CHEMBL3855",
    "parquet_url": "https://data.openml.org/datasets/0003/37708/dataset_37708.pq",
    "processing_date": "2018-10-04 05:37:52",
    "row_id_attribute": "molecule_id",
    "status": "deactivated",
    "tag": [
      "MetaQSAR",
      "study_13"
    ],
    "upload_date": "2016-07-16T01:35:33",
    "url": "https://api.openml.org/data/v1/download/3620151/QSAR-DATASET-FOR-DRUG-TARGET-CHEMBL3855.arff",
    "version": "12",
    "visibility": "public"
  }
}