{
  "data_set_description": {
    "collection_date": "November 2013",
    "creator": "Dr Jeremy Besnard, Dr Ivan Olier, Dr Noureddin Sadawi, Dr Larisa Soldatova, Dr Crina Grosan, Prof Ross King, Dr Richard Bickerton, Prof Andrew Hopkins and Dr Willem van Hoorn",
    "default_target_attribute": "pXC50",
    "description": "This dataset contains QSAR data (from ChEMBL version 17) showing activity values (unit is pseudo-pCI50) of several compounds on drug target ChEMBL_ID: CHEMBL2915 (TID: 12488), and it has 18 rows and 1097 features (not including molecule IDs and class feature: molecule_id and pXC50). The features represent Molecular Descriptors which were generated from SMILES strings. Missing value imputation was applied to this dataset (By choosing the Median).",
    "description_version": "1",
    "file_id": "3620072",
    "format": "ARFF",
    "id": "37703",
    "licence": "Public",
    "md5_checksum": "309008d64bb6e69987816d01328ec0da",
    "minio_url": "https://data.openml.org/datasets/0003/37703/dataset_37703.pq",
    "name": "QSAR-DATASET-FOR-DRUG-TARGET-CHEMBL2915",
    "original_data_url": "https://www.ebi.ac.uk/chembl/target/inspect/CHEMBL2915",
    "parquet_url": "https://data.openml.org/datasets/0003/37703/dataset_37703.pq",
    "processing_date": "2018-10-04 05:43:10",
    "row_id_attribute": "molecule_id",
    "status": "deactivated",
    "tag": [
      "MetaQSAR",
      "study_13"
    ],
    "upload_date": "2016-07-16T01:34:35",
    "url": "https://api.openml.org/data/v1/download/3620072/QSAR-DATASET-FOR-DRUG-TARGET-CHEMBL2915.arff",
    "version": "10",
    "visibility": "public"
  }
}