"molecule_id","nCsp2","Sp","Sv","Se","Si","nBT","nAT","nDB","nC","SCBO","AMW","Me","MW","nH","nSK","nBO","nCsp3","pXC50"
{1 11,2 24.142,3 24.589,4 38.673,5 42.571,6 39,7 37,8 2,9 13,10 36,11 8.955,12 1.045,13 331.33,14 13,15 24,16 26,17 2,18 4.602}
{0 CHEMBL102303,1 11,2 20.318,3 19.709,4 30.262,5 34.235,6 32,7 30,9 12,10 28,11 8.01,12 1.009,13 240.3,14 12,15 18,16 20,17 1,18 5.009}
{0 CHEMBL102418,1 17,2 37.256,3 36.035,4 57.647,5 64.853,6 59,7 57,8 3,9 22,10 46,11 7.641,12 1.011,13 435.54,14 25,15 32,16 34,17 5,18 6.337}
{0 CHEMBL102432,1 11,2 25.756,3 25.213,4 40.785,5 45.983,6 42,7 40,9 14,10 33,11 7.884,12 1.02,13 315.38,14 17,15 23,16 25,17 3,18 4.538}
{0 CHEMBL102444,1 11,2 27.972,3 27.455,4 44.996,5 50.608,6 46,7 44,9 15,10 35,11 7.85,12 1.023,13 345.41,14 19,15 25,16 27,17 4,18 4.469}
{0 CHEMBL102447,1 19,2 49.881,3 48.529,4 79.374,5 88.767,6 80,7 78,8 5,9 29,10 59,11 7.612,12 1.018,13 593.71,14 35,15 43,16 45,17 10,18 6.347}
{0 CHEMBL102518,1 11,2 22.989,3 22.665,4 35.8,5 40.069,6 37,7 35,9 13,10 31,11 8.181,12 1.023,13 286.33,14 14,15 21,16 23,17 2,18 4.921}
{0 CHEMBL102850,1 17,2 34.943,3 34.202,4 53.989,5 60.149,6 55,7 53,8 3,9 21,10 45,11 7.972,12 1.019,13 422.49,14 22,15 31,16 33,17 4,18 6.569}
{0 CHEMBL102967,1 17,2 37.256,3 36.035,4 57.647,5 64.853,6 59,7 57,8 3,9 22,10 46,11 7.641,12 1.011,13 435.54,14 25,15 32,16 34,17 5,18 5.886}
{0 CHEMBL102996,1 16,2 34.835,3 33.884,4 53.283,5 59.152,6 54,7 52,8 4,9 19,10 46,11 8.53,12 1.025,13 443.54,14 21,15 31,16 33,17 3,18 6.337}
{0 CHEMBL103086,1 19,2 42.835,3 42.421,4 67.84,5 75.106,6 68,7 66,8 5,9 25,10 55,11 8.145,12 1.028,13 537.59,14 27,15 39,16 41,17 6,18 7}
{0 CHEMBL103108,1 17,2 27.08,3 26.236,4 38.145,5 42.651,6 42,7 38,9 18,10 39,11 8.273,12 1.004,13 314.38,14 14,15 24,16 28,17 1,18 4.456}
{0 CHEMBL103474,1 11,2 25.205,3 24.907,4 40.011,5 44.694,6 41,7 39,9 14,10 33,11 8.112,12 1.026,13 316.36,14 16,15 23,16 25,17 3,18 4.502}
{0 CHEMBL103558,1 17,2 41.779,3 40.089,4 64.414,5 72.684,6 67,7 64,8 3,9 25,10 50,11 7.431,12 1.006,13 475.61,14 29,15 35,16 38,17 8,18 5.658}
{0 CHEMBL103971,1 17,2 41.779,3 40.089,4 64.414,5 72.684,6 67,7 64,8 3,9 25,10 50,11 7.431,12 1.006,13 475.61,14 29,15 35,16 38,17 8,18 6.022}
{0 CHEMBL103981,1 17,2 33.182,3 32.675,4 51.105,5 56.734,6 52,7 50,8 3,9 20,10 44,11 8.169,12 1.022,13 408.46,14 20,15 30,16 32,17 3,18 6.569}
{0 CHEMBL104020,1 17,2 35.495,3 34.509,4 54.763,5 61.438,6 56,7 54,8 3,9 21,10 45,11 7.806,12 1.014,13 421.51,14 23,15 31,16 33,17 4,18 6.237}
{0 CHEMBL1043,1 12,2 20.375,3 19.294,4 29.353,5 32.411,6 30,7 29,8 2,9 12,10 26,11 8.563,12 1.012,13 248.33,14 12,15 17,16 18,18 5.824}
{0 CHEMBL104495,1 4,2 26.182,3 25.426,4 43.749,5 48.132,6 43,7 42,8 4,9 12,10 28,11 8.34,12 1.042,13 350.3,14 19,15 23,16 24,17 8,18 4.921}
{0 CHEMBL105020,1 11,2 23.443,3 23.38,4 37.127,5 41.279,6 38,7 36,9 13,10 32,11 8.398,12 1.031,13 302.33,14 14,15 22,16 24,17 2,18 4.167}
{0 CHEMBL105323,1 11,2 22.989,3 22.665,4 35.8,5 40.069,6 37,7 35,9 13,10 31,11 8.181,12 1.023,13 286.33,14 14,15 21,16 23,17 2,18 5.046}
{0 CHEMBL105523,1 11,2 25.205,3 24.907,4 40.011,5 44.694,6 41,7 39,9 14,10 33,11 8.112,12 1.026,13 316.36,14 16,15 23,16 25,17 3,18 4.658}
{0 CHEMBL105526,1 16,2 36.705,3 35.729,4 56.872,5 63.564,6 59,7 56,8 2,9 22,10 46,11 7.795,12 1.016,13 436.52,14 24,15 32,16 35,17 6,18 6.032}
{0 CHEMBL105759,1 11,2 25.205,3 24.907,4 40.011,5 44.694,6 41,7 39,9 14,10 33,11 8.112,12 1.026,13 316.36,14 16,15 23,16 25,17 3,18 4.77}
{0 CHEMBL106070,1 11,2 22.989,3 22.665,4 35.8,5 40.069,6 37,7 35,9 13,10 31,11 8.181,12 1.023,13 286.33,14 14,15 21,16 23,17 2,18 4.427}
{0 CHEMBL106383,1 15,2 25.534,3 24.95,4 37.473,5 41.86,6 40,7 37,9 16,10 36.5,11 8.28,12 1.013,13 306.36,14 14,15 23,16 26,17 1,18 4.886}
{0 CHEMBL113816,1 14,2 30.029,3 28.751,4 46.232,5 52.232,6 48,7 46,9 18,10 35.5,11 7.379,12 1.005,13 339.44,14 21,15 25,16 27,17 4,18 7.623}
{0 CHEMBL113999,1 14,2 30.483,3 29.466,4 47.56,5 53.441,6 49,7 47,9 18,10 36.5,11 7.563,12 1.012,13 355.44,14 21,15 26,16 28,17 4,18 5.168}
{0 CHEMBL114354,1 14,2 31.881,3 29.848,4 47.461,5 54.228,6 51,7 48,9 20,10 36.5,11 6.947,12 0.989,13 333.48,14 23,15 25,16 28,17 6,18 7.77}
{0 CHEMBL114668,1 13,2 33.705,3 32.729,4 53.872,5 60.564,6 55,7 53,8 2,9 19,10 39,11 7.556,12 1.016,13 400.49,14 24,15 29,16 31,17 6,18 5.585}
{0 CHEMBL114833,1 14,2 30.483,3 29.466,4 47.56,5 53.441,6 49,7 47,9 18,10 36.5,11 7.563,12 1.012,13 355.44,14 21,15 26,16 28,17 4,18 5.268}
{0 CHEMBL114839,1 14,2 30.12,3 28.321,4 44.578,5 50.813,6 48,7 45,9 19,10 35.5,11 7.099,12 0.991,13 319.45,14 21,15 24,16 27,17 5,18 6.143}
{0 CHEMBL115474,1 14,2 23.836,3 22.741,4 34.927,5 39.568,6 37,7 35,9 15,10 30.5,11 7.581,12 0.998,13 265.35,14 15,15 20,16 22,17 1,18 5.061}
{0 CHEMBL115788,1 14,2 32.943,3 32.202,4 51.989,5 58.149,6 53,7 51,8 1,9 19,10 40.5,11 7.813,12 1.019,13 398.47,14 22,15 29,16 31,17 5,18 6.26}
{0 CHEMBL115804,1 14,2 30.029,3 28.751,4 46.232,5 52.232,6 48,7 46,9 18,10 35.5,11 7.379,12 1.005,13 339.44,14 21,15 25,16 27,17 4,18 7}
{0 CHEMBL116200,1 14,2 28.267,3 27.224,4 43.349,5 48.817,6 45,7 43,9 17,10 34.5,11 7.568,12 1.008,13 325.41,14 19,15 24,16 26,17 3,18 5.357}
{0 CHEMBL116614,1 14,2 28.012,3 27.132,4 40.004,5 44.163,6 41,7 39,8 1,9 16,10 36.5,11 9.673,12 1.026,13 377.26,14 14,15 25,16 27,17 2,18 6.292}
{0 CHEMBL116637,1 14,2 30.483,3 29.466,4 47.56,5 53.441,6 49,7 47,9 18,10 36.5,11 7.563,12 1.012,13 355.44,14 21,15 26,16 28,17 4,18 5.31}
{0 CHEMBL116815,1 14,2 28.267,3 27.224,4 43.349,5 48.817,6 45,7 43,9 17,10 34.5,11 7.568,12 1.008,13 325.41,14 19,15 24,16 26,17 3,18 5.658}
{0 CHEMBL116816,1 14,2 28.267,3 27.224,4 43.349,5 48.817,6 45,7 43,9 17,10 34.5,11 7.568,12 1.008,13 325.41,14 19,15 24,16 26,17 3,18 5.337}
{0 CHEMBL117172,1 11,2 34.466,3 33.256,4 55.756,5 62.979,6 57,7 55,8 1,9 19,10 38,11 7.318,12 1.014,13 402.51,14 26,15 29,16 31,17 8,18 5.921}
{0 CHEMBL117750,1 14,2 32.245,3 30.993,4 50.443,5 56.857,6 52,7 50,9 19,10 37.5,11 7.389,12 1.009,13 369.47,14 23,15 27,16 29,17 5,18 7.284}
{0 CHEMBL119,1 14,2 32.245,3 30.993,4 50.443,5 56.857,6 52,7 50,9 19,10 37.5,11 7.389,12 1.009,13 369.47,14 23,15 27,16 29,17 5,18 7.377}
{0 CHEMBL119315,1 8,2 27.336,3 25.563,4 43.789,5 50.438,6 45,7 44,8 2,9 15,10 27,11 6.578,12 0.995,13 289.43,14 23,15 21,16 22,17 7,18 6.2}
{0 CHEMBL120821,1 10,2 35.767,3 34.046,4 56.211,5 63.687,6 58,7 56,9 21,10 39,11 7.099,12 1.004,13 397.53,14 27,15 29,16 31,17 9,18 6.924}
{0 CHEMBL120826,1 10,2 28.12,3 26.321,4 42.578,5 48.813,6 46,7 43,9 17,10 31,11 6.87,12 0.99,13 295.43,14 21,15 22,16 25,17 7,18 6.678}
{0 CHEMBL120939,1 10,2 33.313,3 31.331,4 52.883,5 60.478,6 55,7 53,9 19,10 34,11 6.745,12 0.998,13 357.51,14 27,15 26,16 28,17 9,18 5.804}
{0 CHEMBL120994,1 10,2 27.074,3 25.45,4 39.342,5 44.286,6 41,7 39,9 15,10 30,11 8.674,12 1.009,13 338.27,14 17,15 22,16 24,17 5,18 5.168}
{0 CHEMBL121264,1 14,2 30.12,3 28.321,4 44.578,5 50.813,6 48,7 45,9 19,10 35.5,11 7.099,12 0.991,13 319.45,14 21,15 24,16 27,17 5,18 6.287}
{0 CHEMBL121319,1 10,2 27.074,3 25.45,4 39.342,5 44.286,6 41,7 39,9 15,10 30,11 8.674,12 1.009,13 338.27,14 17,15 22,16 24,17 5,18 6.387}
{0 CHEMBL121348,1 14,2 31.881,3 29.848,4 47.461,5 54.228,6 51,7 48,9 20,10 36.5,11 6.947,12 0.989,13 333.48,14 23,15 25,16 28,17 6,18 7}
{0 CHEMBL121433,1 10,2 28.836,3 26.976,4 42.225,5 47.701,6 44,7 42,9 16,10 31,11 8.388,12 1.005,13 352.3,14 19,15 23,16 25,17 6,18 6.609}
{0 CHEMBL121683,1 10,2 33.313,3 31.331,4 52.883,5 60.478,6 55,7 53,9 19,10 34,11 6.745,12 0.998,13 357.51,14 27,15 26,16 28,17 9,18 6.943}
{0 CHEMBL121868,1 10,2 31.552,3 29.805,4 50,5 57.062,6 52,7 50,9 18,10 33,11 6.87,12 1,13 343.48,14 25,15 25,16 27,17 8,18 6.523}
{0 CHEMBL121947,1 10,2 26.216,3 24.622,4 39.018,5 44.342,6 41,7 39,9 15,10 29,11 7.791,12 1,13 303.83,14 18,15 21,16 23,17 5,18 6.027}
{0 CHEMBL122214,1 12,2 32.483,3 30.678,4 47.865,5 53.203,6 49,7 47,9 17,10 37,11 9.668,12 1.018,13 454.39,14 20,15 27,16 29,17 5,18 4.509}
{0 CHEMBL122259,1 12,2 28.506,3 26.91,4 40.771,5 45.163,6 42,7 40,9 15,10 34,11 10.258,12 1.019,13 410.33,14 16,15 24,16 26,17 3,18 4}
{0 CHEMBL122704,1 10,2 35.529,3 33.573,4 57.094,5 65.102,6 59,7 57,9 20,10 36,11 6.799,12 1.002,13 387.54,14 29,15 28,16 30,17 10,18 5.509}
{0 CHEMBL122998,1 16,2 27.483,3 25.928,4 38.003,5 42.488,6 41,7 38,9 17,10 36.5,11 8.459,12 1,13 321.44,14 15,15 23,16 26,17 1,18 4.428}
{0 CHEMBL123043,1 10,2 27.978,3 26.149,4 41.902,5 47.757,6 44,7 42,9 16,10 30,11 7.568,12 0.998,13 317.86,14 20,15 22,16 24,17 6,18 6.767}
{0 CHEMBL123122,1 10,2 33.767,3 32.046,4 54.211,5 61.687,6 56,7 54,9 19,10 35,11 6.917,12 1.004,13 373.51,14 27,15 27,16 29,17 9,18 7.022}
{0 CHEMBL123276,1 10,2 26.711,3 24.82,4 38.923,5 44.24,6 41,7 39,9 15,10 29,11 8.93,12 0.998,13 348.28,14 18,15 21,16 23,17 5,18 6.481}
{0 CHEMBL123984,1 12,2 24.938,3 23.643,4 36.331,5 40.697,6 38,7 36,9 14,10 31,11 8.372,12 1.009,13 301.41,14 15,15 21,16 23,17 2,18 4.22}
{0 CHEMBL124256,1 21,2 44.438,3 43.003,4 67.749,5 75.521,6 70,7 67,8 3,9 28,10 55,11 7.696,12 1.011,13 515.62,14 29,15 38,16 41,17 7,18 4.721}
{0 CHEMBL134561,1 12,2 31.239,3 29.971,4 48.342,5 54.358,6 51,7 48,8 1,9 19,10 36,11 7.384,12 1.007,13 354.45,14 22,15 26,16 29,17 7,18 5.62}
{0 CHEMBL137844,1 13,2 24.176,3 23.116,4 34.447,5 38.282,6 36,7 34,9 14,10 31.5,11 8.806,12 1.013,13 299.39,14 13,15 21,16 23,17 1,18 6.155}
{0 CHEMBL137942,1 14,2 31.341,3 30.293,4 47.883,5 53.385,6 49,7 47,9 18,10 37.5,11 8.295,12 1.019,13 389.88,14 20,15 27,16 29,17 4,18 7.481}
{0 CHEMBL137981,1 13,2 26.392,3 25.358,4 38.658,5 42.906,6 40,7 38,9 15,10 33.5,11 8.669,12 1.017,13 329.42,14 15,15 23,16 25,17 2,18 7.066}
{0 CHEMBL138060,1 14,2 29.125,3 28.052,4 43.673,5 48.761,6 45,7 43,9 17,10 35.5,11 8.369,12 1.016,13 359.85,14 18,15 25,16 27,17 3,18 7.276}
{0 CHEMBL138252,1 13,2 22.176,3 21.536,4 31.585,5 35.179,6 33,7 31,9 13,10 30.5,11 9.25,12 1.019,13 286.75,14 11,15 20,16 22,18 4.836}
{0 CHEMBL138265,1 14,2 33.103,3 31.82,4 50.767,5 56.801,6 52,7 50,9 19,10 38.5,11 8.078,12 1.015,13 403.91,14 22,15 28,16 30,17 5,18 6.77}
{0 CHEMBL138419,1 17,2 26.08,3 25.236,4 37.145,5 41.651,6 40,7 37,9 17,10 37,11 8.172,12 1.004,13 302.37,14 14,15 23,16 26,18 4.824}
{0 CHEMBL138452,1 13,2 27.966,3 27.434,4 43.894,5 49.109,6 45,7 43,9 16,10 35.5,11 7.963,12 1.021,13 342.4,14 18,15 25,16 27,17 3,18 4.587}
{0 CHEMBL138625,1 14,2 32.648,3 31.105,4 49.44,5 55.591,6 51,7 49,9 19,10 37.5,11 7.917,12 1.009,13 387.91,14 22,15 27,16 29,17 5,18 4.585}
{0 CHEMBL139188,1 13,2 21.318,3 20.709,4 31.262,5 35.235,6 33,7 31,9 13,10 29.5,11 8.139,12 1.008,13 252.31,14 12,15 19,16 21,18 5.081}
{0 CHEMBL139430,1 17,2 27.841,3 26.762,4 40.029,5 45.066,6 43,7 40,9 18,10 38,11 7.91,12 1.001,13 316.4,14 16,15 24,16 27,17 1,18 7.499}
{0 CHEMBL139485,1 13,2 29.728,3 28.96,4 46.778,5 52.524,6 48,7 46,9 17,10 36.5,11 7.748,12 1.017,13 356.43,14 20,15 26,16 28,17 4,18 7.678}
{0 CHEMBL140597,1 13,2 27.301,3 26.787,4 41.313,5 45.325,6 42,7 40,8 2,9 15,10 37.5,11 9.036,12 1.033,13 361.42,14 15,15 25,16 27,17 2,18 5.569}
{0 CHEMBL140705,1 13,2 23.534,3 22.95,4 35.473,5 39.86,6 37,7 35,9 14,10 31.5,11 8.067,12 1.014,13 282.34,14 14,15 21,16 23,17 1,18 5.061}
{0 CHEMBL140940,1 13,2 23.08,3 22.236,4 34.145,5 38.651,6 36,7 34,9 14,10 30.5,11 7.834,12 1.004,13 266.34,14 14,15 20,16 22,17 1,18 7.002}
{0 CHEMBL141160,1 13,2 25.296,3 24.477,4 38.356,5 43.275,6 40,7 38,9 15,10 32.5,11 7.799,12 1.009,13 296.37,14 16,15 22,16 24,17 2,18 6.658}
{0 CHEMBL141218,1 13,2 23.534,3 22.95,4 35.473,5 39.86,6 37,7 35,9 14,10 31.5,11 8.067,12 1.014,13 282.34,14 14,15 21,16 23,17 1,18 4.044}
{0 CHEMBL141260,1 13,2 25.75,3 25.192,4 39.683,5 44.485,6 41,7 39,9 15,10 33.5,11 8.009,12 1.018,13 312.37,14 16,15 23,16 25,17 2,18 4.793}
{0 CHEMBL141417,1 14,2 33.103,3 31.82,4 50.767,5 56.801,6 52,7 50,9 19,10 38.5,11 8.078,12 1.015,13 403.91,14 22,15 28,16 30,17 5,18 4.367}
{0 CHEMBL141469,1 14,2 34.864,3 33.347,4 53.651,5 60.216,6 55,7 53,9 20,10 39.5,11 7.886,12 1.012,13 417.94,14 24,15 29,16 31,17 6,18 4.022}
{0 CHEMBL141548,1 14,2 24.478,3 22.907,4 33.902,5 37.989,6 36,7 34,9 15,10 30.5,11 8.306,12 0.997,13 282.4,14 14,15 20,16 22,17 1,18 5.022}
{0 CHEMBL141585,1 13,2 25.75,3 25.192,4 39.683,5 44.485,6 41,7 39,9 15,10 33.5,11 8.009,12 1.018,13 312.37,14 16,15 23,16 25,17 2,18 4.394}
{0 CHEMBL141698,1 13,2 27.512,3 26.719,4 42.567,5 47.9,6 44,7 42,9 16,10 34.5,11 7.771,12 1.014,13 326.4,14 18,15 24,16 26,17 3,18 7.469}
{0 CHEMBL141708,1 15,2 27.506,3 26.697,4 41.465,5 46.402,6 43,7 41,8 1,9 17,10 35.5,11 7.888,12 1.011,13 323.39,14 17,15 24,16 26,17 2,18 5.585}
{0 CHEMBL141808,1 13,2 29.728,3 28.96,4 46.778,5 52.524,6 48,7 46,9 17,10 36.5,11 7.748,12 1.017,13 356.43,14 20,15 26,16 28,17 4,18 4.532}
{0 CHEMBL141903,1 14,2 30.887,3 29.579,4 46.556,5 52.176,6 48,7 46,9 18,10 36.5,11 8.128,12 1.012,13 373.88,14 20,15 26,16 28,17 4,18 4.921}
{0 CHEMBL141997,1 17,2 36.256,3 35.744,4 55.64,5 61.302,6 56,7 54,8 3,9 21,10 46.5,11 8.758,12 1.03,13 472.93,14 21,15 33,16 35,17 4,18 5.854}
{0 CHEMBL142081,1 13,2 24.176,3 23.116,4 34.447,5 38.282,6 36,7 34,9 14,10 31.5,11 8.806,12 1.013,13 299.39,14 13,15 21,16 23,17 1,18 5.658}
{0 CHEMBL142345,1 10,2 21.557,3 20.8,4 31.527,5 35.387,6 32,7 31,9 12,10 28,11 8.895,12 1.017,13 275.75,14 12,15 19,16 20,17 2,18 6.721}
{0 CHEMBL142624,1 13,2 30.483,3 29.466,4 47.56,5 53.441,6 49,7 47,9 18,10 36.5,11 7.563,12 1.012,13 355.44,14 21,15 26,16 28,17 5,18 5.301}
{0 CHEMBL142741,1 13,2 31.489,3 30.487,4 49.662,5 55.94,6 51,7 49,9 18,10 37.5,11 7.56,12 1.014,13 370.46,14 22,15 27,16 29,17 5,18 6.62}
{0 CHEMBL144200,1 18,2 30.733,3 29.444,4 42.323,5 47.069,6 46,7 42,9 19,10 42.5,11 8.892,12 1.008,13 373.48,14 15,15 27,16 31,17 1,18 6.921}
{0 CHEMBL144563,1 17,2 37.654,3 35.418,4 56.549,5 64.64,6 60,7 57,9 23,10 44,11 7.045,12 0.992,13 401.57,14 27,15 30,16 33,17 6,18 6.208}
{0 CHEMBL144839,1 18,2 30.847,3 29.784,4 44.131,5 49.564,6 48,7 44,9 20,10 42.5,11 8.078,12 1.003,13 355.44,14 17,15 27,16 31,17 2,18 7.377}
{0 CHEMBL145005,1 15,2 25.29,3 24.456,4 37.254,5 41.777,6 39,7 37,8 1,9 16,10 33.5,11 7.929,12 1.007,13 293.36,14 15,15 22,16 24,17 1,18 5.276}
{0 CHEMBL145060,1 10,2 27.983,3 26.17,4 43.003,5 49.255,6 44,7 43,9 15,10 29,11 7.462,12 1,13 320.87,14 21,15 22,16 23,17 5,18 4.975}
{0 CHEMBL145068,1 13,2 28.267,3 27.224,4 43.349,5 48.817,6 45,7 43,9 17,10 34.5,11 7.568,12 1.008,13 325.41,14 19,15 24,16 26,17 4,18 5.854}
{0 CHEMBL145169,1 15,2 29.722,3 28.939,4 45.676,5 51.026,6 47,7 45,8 1,9 18,10 37.5,11 7.854,12 1.015,13 353.42,14 19,15 26,16 28,17 3,18 5.301}
{0 CHEMBL145221,1 21,2 64.608,3 64.671,4 106.84,5 118.056,6 105,7 103,8 9,9 35,10 79.5,11 8.174,12 1.037,13 841.89,14 43,15 60,16 62,17 14,18 7.456}
{0 CHEMBL145528,1 13,2 26.051,3 24.983,4 39.138,5 44.192,6 41,7 39,9 16,10 32.5,11 7.574,12 1.004,13 295.38,14 17,15 22,16 24,17 3,18 6.538}
{0 CHEMBL145579,1 21,2 41.921,3 40.97,4 64.083,5 71.189,6 66,7 63,8 3,9 26,10 54,11 7.977,12 1.017,13 502.58,14 26,15 37,16 40,17 5,18 6.721}
{0 CHEMBL145628,1 15,2 26.796,3 25.891,4 36.793,5 40.539,6 39,7 36,9 16,10 37.5,11 9.979,12 1.022,13 359.24,14 12,15 24,16 27,17 1,18 8.222}
{0 CHEMBL145691,1 10,2 29.79,3 28.278,4 47.116,5 53.647,6 49,7 47,9 17,10 32,11 7.01,12 1.002,13 329.45,14 23,15 24,16 26,17 7,18 5.114}
{0 CHEMBL146438,1 13,2 29.819,3 28.531,4 45.123,5 51.106,6 48,7 45,9 18,10 36.5,11 7.476,12 1.003,13 336.44,14 20,15 25,16 28,17 5,18 6.602}
{0 CHEMBL146925,1 13,2 29.819,3 28.531,4 45.123,5 51.106,6 48,7 45,9 18,10 36.5,11 7.476,12 1.003,13 336.44,14 20,15 25,16 28,17 5,18 4.824}
{0 CHEMBL147886,1 13,2 33.796,3 32.299,4 52.218,5 59.145,6 55,7 52,9 20,10 39.5,11 7.317,12 1.004,13 380.5,14 24,15 28,16 31,17 7,18 6.071}
{0 CHEMBL148599,1 14,2 29.512,3 28.719,4 44.567,5 49.9,6 47,7 44,8 1,9 18,10 38.5,11 7.964,12 1.013,13 350.42,14 18,15 26,16 29,17 4,18 4.824}
{0 CHEMBL149027,1 13,2 29.318,3 27.944,4 41.56,5 46.369,6 44,7 41,9 17,10 36.5,11 9.153,12 1.014,13 375.29,14 16,15 25,16 28,17 4,18 5.398}
{0 CHEMBL162270,1 14,2 32.245,3 30.993,4 50.443,5 56.857,6 52,7 50,9 19,10 37.5,11 7.389,12 1.009,13 369.47,14 23,15 27,16 29,17 5,18 4.699}
{0 CHEMBL162312,1 14,2 27.5,3 26.676,4 40.363,5 44.903,6 42,7 40,9 18,10 36.5,11 8.009,12 1.009,13 320.38,14 16,15 24,16 26,17 2,18 4.745}
{0 CHEMBL164845,1 16,2 23.83,3 22.72,4 33.825,5 38.069,6 36,7 34,8 1,9 16,10 31.5,11 7.716,12 0.995,13 262.34,14 14,15 20,16 22,18 5}
{0 CHEMBL165955,1 14,2 30.483,3 29.466,4 47.56,5 53.441,6 49,7 47,9 18,10 36.5,11 7.563,12 1.012,13 355.44,14 21,15 26,16 28,17 4,18 4.699}
{0 CHEMBL16950,1 12,2 28.176,3 27.654,4 45.003,5 50.236,6 46,7 44,9 16,10 35,11 7.85,12 1.023,13 345.4,14 19,15 25,16 27,17 4,18 5.398}
{0 CHEMBL17044,1 12,2 25.96,3 25.412,4 40.793,5 45.611,6 42,7 40,9 15,10 33,11 7.884,12 1.02,13 315.37,14 17,15 23,16 25,17 3,18 4.678}
{0 CHEMBL17232,1 15,2 33.642,3 33.411,4 53.534,5 59.442,6 54,7 52,8 3,9 19,10 44,11 8.221,12 1.03,13 427.47,14 21,15 31,16 33,17 4,18 7.42}
{0 CHEMBL17235,1 12,2 24.102,3 23.412,4 33.342,5 36.194,6 34,7 32,9 13,10 32,11 11.207,12 1.042,13 358.63,14 10,15 22,16 24,17 1,18 5.081}
{0 CHEMBL172353,1 10,2 31,3 29.498,4 49.225,5 55.773,6 51,7 49,9 18,10 33,11 7.03,12 1.005,13 344.46,14 24,15 25,16 27,17 8,18 5.745}
{0 CHEMBL172558,1 8,2 30.404,3 27.902,4 48.229,5 56.059,6 50,7 49,8 2,9 17,10 28,11 6.153,12 0.984,13 301.49,14 27,15 22,16 23,17 9,18 8.1}
{0 CHEMBL17287,1 15,2 37.165,3 36.465,4 59.302,5 66.272,6 60,7 58,8 3,9 21,10 46,11 7.854,12 1.022,13 455.53,14 25,15 33,16 35,17 6,18 7.357}
{0 CHEMBL17323,1 12,2 26.512,3 25.719,4 41.567,5 46.9,6 43,7 41,9 15,10 33,11 7.668,12 1.014,13 314.39,14 18,15 23,16 25,17 3,18 4.34}
{0 CHEMBL17383,1 15,2 33.091,3 33.105,4 52.76,5 58.153,6 53,7 51,8 3,9 19,10 44,11 8.401,12 1.035,13 428.45,14 20,15 31,16 33,17 4,18 6.046}
{0 CHEMBL174107,1 8,2 23.245,3 21.455,4 34.887,5 39.903,6 36,7 35,8 2,9 12,10 24,11 7.526,12 0.997,13 263.41,14 17,15 18,16 19,17 4,18 6.6}
{0 CHEMBL17430,1 12,2 24.438,3 23.056,4 32.767,5 35.96,6 34,7 32,9 13,10 31,11 10.633,12 1.024,13 340.26,14 11,15 21,16 23,17 1,18 4.233}
{0 CHEMBL17431,1 12,2 27.154,3 25.885,4 40.542,5 45.322,6 42,7 40,9 15,10 33,11 8.286,12 1.014,13 331.44,14 17,15 23,16 25,17 3,18 4.955}
{0 CHEMBL17453,1 12,2 28.273,3 27.246,4 44.451,5 50.315,6 46,7 44,9 16,10 34,11 7.464,12 1.01,13 328.42,14 20,15 24,16 26,17 4,18 4.921}
{0 CHEMBL174559,1 8,2 32.165,3 29.429,4 51.112,5 59.474,6 53,7 52,8 2,9 18,10 29,11 6.068,12 0.983,13 315.52,14 29,15 23,16 24,17 10,18 8.2}
{0 CHEMBL17479,1 16,2 27.483,3 25.928,4 38.003,5 42.488,6 41,7 38,9 17,10 36.5,11 8.459,12 1,13 321.44,14 15,15 23,16 26,17 1,18 4.975}
{0 CHEMBL176332,1 10,2 32.762,3 31.025,4 52.109,5 59.189,6 54,7 52,9 19,10 34,11 6.894,12 1.002,13 358.49,14 26,15 26,16 28,17 9,18 5.886}
{0 CHEMBL176935,1 8,2 37.449,3 34.009,4 59.763,5 69.72,6 62,7 61,8 2,9 21,10 32,11 5.862,12 0.98,13 357.61,14 35,15 26,16 27,17 13,18 7.8}
{0 CHEMBL176987,1 8,2 33.927,3 30.955,4 53.996,5 62.889,6 56,7 55,8 2,9 19,10 30,11 5.992,12 0.982,13 329.55,14 31,15 24,16 25,17 11,18 8.2}
{0 CHEMBL178512,1 17,2 36.046,3 34.815,4 55.538,5 62.727,6 58,7 55,9 21,10 45,11 7.646,12 1.01,13 420.53,14 24,15 31,16 34,17 4,18 5.745}
{0 CHEMBL178684,1 10,2 39.052,3 36.627,4 62.861,5 71.933,6 65,7 63,9 22,10 38,11 6.597,12 0.998,13 415.6,14 33,15 30,16 32,17 12,18 5.509}
{0 CHEMBL17873,1 12,2 23.796,3 22.891,4 33.793,5 37.539,6 35,7 33,9 13,10 31,11 9.794,12 1.024,13 323.21,14 12,15 21,16 23,17 1,18 4.452}
{0 CHEMBL178888,1 19,2 35.586,3 34.079,4 53.109,5 60.019,6 56,7 53,9 22,10 44.5,11 7.576,12 1.002,13 401.52,14 23,15 30,16 33,17 3,18 7.194}
{0 CHEMBL178904,1 10,2 26.216,3 24.622,4 39.018,5 44.342,6 41,7 39,9 15,10 29,11 7.791,12 1,13 303.83,14 18,15 21,16 23,17 5,18 6.027}
{0 CHEMBL179102,1 18,2 28.597,3 27.268,4 40.811,5 45.983,6 44,7 41,9 19,10 38,11 7.693,12 0.995,13 315.41,14 17,15 24,16 27,17 1,18 6.143}
{0 CHEMBL179131,1 17,2 33.279,3 32.267,4 50.552,5 56.813,6 53,7 50,9 20,10 43,11 7.83,12 1.011,13 391.48,14 21,15 29,16 32,17 3,18 6.456}
{0 CHEMBL179319,1 13,2 26.603,3 25.289,4 39.912,5 45.481,6 42,7 40,9 16,10 32.5,11 7.36,12 0.998,13 294.4,14 18,15 22,16 24,17 3,18 7.523}
{0 CHEMBL180476,1 17,2 38.66,3 36.439,4 58.65,5 67.138,6 62,7 59,9 23,10 45,11 7.061,12 0.994,13 416.59,14 28,15 31,16 34,17 6,18 6.208}
{0 CHEMBL187570,1 13,2 28.711,3 26.299,4 39.207,5 43.913,6 41,7 39,9 16,10 33.5,11 10.802,12 1.005,13 421.27,14 16,15 23,16 25,17 3,18 8.237}
{0 CHEMBL187595,1 14,2 35.245,3 33.993,4 53.443,5 59.857,6 55,7 53,8 1,9 22,10 43.5,11 7.651,12 1.008,13 405.5,14 23,15 30,16 32,17 6,18 8.921}
{0 CHEMBL188540,1 14,2 37.222,3 35.761,4 58.538,5 65.896,6 60,7 58,8 1,9 22,10 42.5,11 7.337,12 1.009,13 425.54,14 27,15 31,16 33,17 8,18 8.886}
{0 CHEMBL189012,1 21,2 41.04,3 39.794,4 59.436,5 66.229,6 63,7 59,8 2,9 27,10 55.5,11 8.094,12 1.007,13 477.57,14 23,15 36,16 40,17 4,18 7.921}
{0 CHEMBL189369,1 21,2 39.279,3 38.267,4 56.552,5 62.813,6 60,7 56,8 2,9 26,10 54.5,11 8.277,12 1.01,13 463.54,14 21,15 35,16 39,17 3,18 6.638}
{0 CHEMBL189796,1 14,2 37.222,3 35.761,4 58.538,5 65.896,6 60,7 58,8 1,9 22,10 42.5,11 7.337,12 1.009,13 425.54,14 27,15 31,16 33,17 8,18 8.187}
{0 CHEMBL189952,1 14,2 33.699,3 32.707,4 52.771,5 59.066,6 54,7 52,8 1,9 20,10 40.5,11 7.644,12 1.015,13 397.48,14 23,15 29,16 31,17 6,18 9.367}
{0 CHEMBL189953,1 14,2 38.983,3 37.288,4 61.421,5 69.312,6 63,7 61,8 1,9 23,10 43.5,11 7.206,12 1.007,13 439.57,14 29,15 32,16 34,17 9,18 7.553}
{0 CHEMBL190026,1 13,2 28.711,3 26.299,4 39.207,5 43.913,6 41,7 39,9 16,10 33.5,11 10.802,12 1.005,13 421.27,14 16,15 23,16 25,17 3,18 8.42}
{0 CHEMBL190199,1 14,2 35.461,3 34.234,4 55.654,5 62.481,6 57,7 55,8 1,9 21,10 41.5,11 7.482,12 1.012,13 411.51,14 25,15 30,16 32,17 7,18 9.292}
{0 CHEMBL190340,1 19,2 35.79,3 34.278,4 53.116,5 59.647,6 56,7 53,9 23,10 44.5,11 7.576,12 1.002,13 401.51,14 23,15 30,16 33,17 4,18 7.018}
{0 CHEMBL190486,1 14,2 33.699,3 32.707,4 52.771,5 59.066,6 54,7 52,8 1,9 20,10 40.5,11 7.644,12 1.015,13 397.48,14 23,15 29,16 31,17 6,18 9.77}
{0 CHEMBL190650,1 14,2 33.483,3 32.466,4 50.56,5 56.441,6 52,7 50,8 1,9 21,10 42.5,11 7.829,12 1.011,13 391.47,14 21,15 29,16 31,17 5,18 10.013}
{0 CHEMBL190807,1 21,2 37.517,3 36.74,4 53.669,5 59.398,6 57,7 53,8 2,9 25,10 53.5,11 8.481,12 1.013,13 449.51,14 19,15 34,16 38,17 2,18 8.027}
{0 CHEMBL190935,1 14,2 37.222,3 35.761,4 58.538,5 65.896,6 60,7 58,8 1,9 22,10 42.5,11 7.337,12 1.009,13 425.54,14 27,15 31,16 33,17 8,18 7.081}
{0 CHEMBL191071,1 11,2 29.068,3 27.943,4 42.803,5 47.369,6 43,7 42,8 1,9 17,10 35,11 9.65,12 1.019,13 405.28,14 17,15 25,16 26,17 4,18 7.149}
{0 CHEMBL192835,1 14,2 37.006,3 35.519,4 56.327,5 63.272,6 58,7 56,8 1,9 23,10 44.5,11 7.492,12 1.006,13 419.53,14 25,15 31,16 33,17 7,18 8.745}
{0 CHEMBL20129,1 8,2 36.143,3 33.197,4 58.207,5 67.514,6 60,7 59,8 2,9 20,10 32,11 6.095,12 0.987,13 359.58,14 33,15 26,16 27,17 12,18 8.17}
{0 CHEMBL20227,1 14,2 34.858,3 32.617,4 53.556,5 61.268,6 56,7 54,8 2,9 21,10 37,11 6.769,12 0.992,13 365.53,14 27,15 27,16 29,17 7,18 8.32}
{0 CHEMBL20368,1 16,2 35.046,3 33.815,4 54.538,5 61.727,6 56,7 54,8 4,9 20,10 42,11 7.565,12 1.01,13 408.52,14 24,15 30,16 32,17 4,18 7.82}
{0 CHEMBL20424,1 20,2 37.097,3 35.09,4 54.672,5 61.853,6 58,7 55,8 2,9 24,10 44,11 7.264,12 0.994,13 399.54,14 25,15 30,16 33,17 4,18 8.35}
{0 CHEMBL20466,1 18,2 34.336,3 32.563,4 50.789,5 57.438,6 54,7 51,8 2,9 22,10 41.5,11 7.324,12 0.996,13 373.5,14 23,15 28,16 31,17 4,18 8.27}
{0 CHEMBL20480,1 14,2 31.336,3 29.563,4 47.789,5 54.438,6 50,7 48,8 2,9 19,10 35,11 7.031,12 0.996,13 337.47,14 23,15 25,16 27,17 5,18 7.71}
{0 CHEMBL20528,1 15,2 33.04,3 31.794,4 51.436,5 58.229,6 53,7 51,8 3,9 19,10 39,11 7.48,12 1.009,13 381.49,14 23,15 28,16 30,17 4,18 8.34}
{0 CHEMBL20628,1 14,2 33.364,3 32.955,4 53.538,5 60.081,6 54,7 52,8 2,9 20,10 40,11 8.105,12 1.03,13 421.47,14 22,15 30,16 32,17 6,18 7.65}
{0 CHEMBL20812,1 15,2 33.796,3 32.299,4 52.218,5 59.145,6 54,7 52,8 3,9 20,10 39,11 7.317,12 1.004,13 380.5,14 24,15 28,16 30,17 5,18 8.489}
{0 CHEMBL20861,1 8,2 20.989,3 20.665,4 33.8,5 38.069,6 34,7 33,8 4,9 11,10 27,11 7.949,12 1.024,13 262.31,14 14,15 19,16 20,17 3,18 6.88}
{0 CHEMBL20922,1 14,2 38.381,3 35.67,4 59.323,5 68.099,6 62,7 60,8 2,9 23,10 39,11 6.56,12 0.989,13 393.59,14 31,15 29,16 31,17 9,18 7.77}
{0 CHEMBL20975,1 14,2 30.767,3 28.509,4 44.654,5 50.733,6 47,7 45,8 2,9 18,10 34,11 7.545,12 0.992,13 339.51,14 21,15 24,16 26,17 4,18 8.55}
{0 CHEMBL21031,1 14,2 30.767,3 28.509,4 44.654,5 50.733,6 47,7 45,8 2,9 18,10 34,11 7.545,12 0.992,13 339.51,14 21,15 24,16 26,17 4,18 8.27}
{0 CHEMBL21032,1 8,2 30.858,3 28.617,4 49.556,5 57.268,6 51,7 50,8 2,9 17,10 29,11 6.35,12 0.991,13 317.49,14 27,15 23,16 24,17 9,18 7.67}
{0 CHEMBL21051,1 14,2 29.574,3 28.036,4 44.905,5 51.023,6 47,7 45,8 2,9 18,10 34,11 7.188,12 0.998,13 323.44,14 21,15 24,16 26,17 4,18 5.93}
{0 CHEMBL21077,1 14,2 31.625,3 29.336,4 44.978,5 50.677,6 47,7 45,8 2,9 18,10 35,11 8.31,12 1,13 373.95,14 20,15 25,16 27,17 4,18 8.58}
{0 CHEMBL22,1 10,2 24.716,3 23.918,4 39.574,5 44.528,6 40,7 39,9 14,10 28,11 7.445,12 1.015,13 290.36,14 18,15 21,16 22,17 4,18 4.698}
{0 CHEMBL22434,1 16,2 27.728,3 26.423,4 38.222,5 42.571,6 41,7 38,9 17,10 38,11 8.801,12 1.006,13 334.44,14 14,15 24,16 27,17 1,18 5.377}
{0 CHEMBL22477,1 16,2 25.739,3 25.149,4 37.48,5 41.488,6 40,7 37,9 17,10 36.5,11 8.28,12 1.013,13 306.35,14 14,15 23,16 26,17 1,18 4.854}
{0 CHEMBL22543,1 12,2 28.517,3 27.74,4 44.669,5 50.398,6 46,7 44,9 16,10 35.5,11 7.76,12 1.015,13 341.42,14 19,15 25,16 27,17 4,18 5.409}
{0 CHEMBL22561,1 16,2 28.051,3 26.983,4 41.138,5 46.192,6 44,7 41,9 18,10 37.5,11 7.79,12 1.003,13 319.4,14 17,15 24,16 27,17 2,18 4.83}
{0 CHEMBL22623,1 13,2 31.034,3 29.772,4 48.334,5 54.73,6 50,7 48,9 18,10 36.5,11 7.385,12 1.007,13 354.46,14 22,15 26,16 28,17 5,18 6.886}
{0 CHEMBL22672,1 12,2 23.182,3 22.558,4 33.687,5 37.678,6 35,7 33,9 13,10 31.5,11 9.145,12 1.021,13 301.77,14 12,15 21,16 23,17 1,18 5.824}
{0 CHEMBL22677,1 13,2 26.341,3 24.756,4 36.327,5 40.432,6 38,7 36,9 15,10 32.5,11 9.218,12 1.009,13 331.86,14 14,15 22,16 24,17 2,18 6.444}
{0 CHEMBL22820,1 12,2 22.171,3 21.095,4 31.345,5 34.783,6 33,7 31,9 13,10 29,11 8.786,12 1.011,13 272.36,14 12,15 19,16 21,17 1,18 4.585}
{0 CHEMBL22924,1 17,2 27.841,3 26.762,4 40.029,5 45.066,6 43,7 40,9 18,10 38,11 7.91,12 1.001,13 316.4,14 16,15 24,16 27,17 1,18 6.585}
{0 CHEMBL23021,1 13,2 29.273,3 28.246,4 45.451,5 51.315,6 47,7 45,9 17,10 35.5,11 7.565,12 1.01,13 340.43,14 20,15 25,16 27,17 4,18 7.648}
{0 CHEMBL23054,1 12,2 27.722,3 26.939,4 43.676,5 49.026,6 45,7 43,9 16,10 34,11 7.66,12 1.016,13 329.4,14 19,15 24,16 26,17 4,18 4.569}
{0 CHEMBL23076,1 13,2 30.392,3 30.208,4 48.545,5 54.54,6 49,7 47,9 18,10 38.5,11 8.35,12 1.033,13 392.43,14 19,15 28,16 30,17 5,18 7.032}
{0 CHEMBL23092,1 14,2 24.693,3 23.569,4 35.251,5 39.512,6 37,7 35,9 15,10 31.5,11 8.565,12 1.007,13 299.79,14 14,15 21,16 23,17 1,18 6.222}
{0 CHEMBL23146,1 12,2 25.182,3 24.138,4 36.549,5 40.78,6 38,7 36,9 14,10 32.5,11 8.734,12 1.015,13 314.41,14 14,15 22,16 24,17 2,18 4.764}
{0 CHEMBL23153,1 12,2 25.006,3 24.111,4 35.902,5 39.665,6 37,7 35,9 14,10 32,11 9.663,12 1.026,13 338.22,14 13,15 22,16 24,17 2,18 4.349}
{0 CHEMBL23211,1 18,2 28.597,3 27.268,4 40.811,5 45.983,6 44,7 41,9 19,10 38,11 7.693,12 0.995,13 315.41,14 17,15 24,16 27,17 1,18 6.678}
{0 CHEMBL23220,1 13,2 32.887,3 30.87,4 49.563,5 56.727,6 53,7 50,9 20,10 37.5,11 6.97,12 0.991,13 348.5,14 24,15 26,16 29,17 7,18 6.824}
{0 CHEMBL23227,1 14,2 26.455,3 25.095,4 38.134,5 42.927,6 40,7 38,9 16,10 32.5,11 8.258,12 1.004,13 313.82,14 16,15 22,16 24,17 2,18 6.481}
{0 CHEMBL23244,1 13,2 29.915,3 28.411,4 44.425,5 49.737,6 46,7 44,9 17,10 35.5,11 8.125,12 1.01,13 357.48,14 19,15 25,16 27,17 4,18 6.824}
{0 CHEMBL23272,1 13,2 27.245,3 25.455,4 38.887,5 43.903,6 41,7 39,9 16,10 32.5,11 7.986,12 0.997,13 311.45,14 17,15 22,16 24,17 3,18 6.77}
{0 CHEMBL23286,1 12,2 27.398,3 26.379,4 40.76,5 45.405,6 42,7 40,9 15,10 34.5,11 8.611,12 1.019,13 344.44,14 16,15 24,16 26,17 3,18 4.235}
{0 CHEMBL23288,1 13,2 29.728,3 28.96,4 46.778,5 52.524,6 48,7 46,9 17,10 36.5,11 7.748,12 1.017,13 356.43,14 20,15 26,16 28,17 4,18 5.824}
{0 CHEMBL23297,1 18,2 29.506,3 28.697,4 43.465,5 48.402,6 46,7 43,9 19,10 40,11 8.079,12 1.011,13 347.41,14 17,15 26,16 29,17 1,18 5.092}
{0 CHEMBL23353,1 18,2 29.506,3 28.697,4 43.465,5 48.402,6 46,7 43,9 19,10 40,11 8.079,12 1.011,13 347.41,14 17,15 26,16 29,17 1,18 4.921}
{0 CHEMBL23374,1 17,2 30.358,3 28.795,4 43.694,5 49.398,6 47,7 44,9 20,10 39,11 7.487,12 0.993,13 329.44,14 19,15 25,16 28,17 3,18 7.194}
{0 CHEMBL23380,1 12,2 25.182,3 24.138,4 36.549,5 40.78,6 38,7 36,9 14,10 32.5,11 8.734,12 1.015,13 314.41,14 14,15 22,16 24,17 2,18 5.004}
{0 CHEMBL23382,1 13,2 28.819,3 27.531,4 44.123,5 50.106,6 46,7 44,9 17,10 34.5,11 7.373,12 1.003,13 324.43,14 20,15 24,16 26,17 4,18 6.77}
{0 CHEMBL23383,1 13,2 28.364,3 26.816,4 42.796,5 48.896,6 45,7 43,9 17,10 33.5,11 7.173,12 0.995,13 308.43,14 20,15 23,16 25,17 4,18 7.523}
{0 CHEMBL23402,1 12,2 26.756,3 26.213,4 41.785,5 46.983,6 43,7 41,9 15,10 34.5,11 7.985,12 1.019,13 327.39,14 17,15 24,16 26,17 3,18 5.208}
{0 CHEMBL23416,1 13,2 25.699,3 24.59,4 37.353,5 42.01,6 39,7 37,9 15,10 32.5,11 8.508,12 1.01,13 314.81,14 15,15 22,16 24,17 2,18 6.959}
{0 CHEMBL23425,1 12,2 24.728,3 23.423,4 35.222,5 39.571,6 37,7 35,9 14,10 31.5,11 8.526,12 1.006,13 298.41,14 14,15 21,16 23,17 2,18 4.523}
{0 CHEMBL23454,1 14,2 28.267,3 27.224,4 43.349,5 48.817,6 45,7 43,9 17,10 34.5,11 7.568,12 1.008,13 325.41,14 19,15 24,16 26,17 3,18 6.125}
{0 CHEMBL23459,1 12,2 28.972,3 28.455,4 45.996,5 51.608,6 47,7 45,9 16,10 36.5,11 7.943,12 1.022,13 357.42,14 19,15 26,16 28,17 4,18 5.155}
{0 CHEMBL23466,1 12,2 26.114,3 26.649,4 41.996,5 46.793,6 42,7 40,9 15,10 36.5,11 9.134,12 1.05,13 365.36,14 14,15 26,16 28,17 3,18 6.167}
{0 CHEMBL23492,1 13,2 23.938,3 23.063,4 34.469,5 38.595,6 36,7 34,9 14,10 31.5,11 8.846,12 1.014,13 300.78,14 13,15 21,16 23,17 1,18 6.013}
{0 CHEMBL23495,1 12,2 26.114,3 26.649,4 41.996,5 46.793,6 42,7 40,9 15,10 36.5,11 9.134,12 1.05,13 365.36,14 14,15 26,16 28,17 3,18 4.678}
{0 CHEMBL23532,1 13,2 31.489,3 30.487,4 49.662,5 55.94,6 51,7 49,9 18,10 37.5,11 7.56,12 1.014,13 370.46,14 22,15 27,16 29,17 5,18 7.377}
{0 CHEMBL23560,1 12,2 26.301,3 25.499,4 40.458,5 45.774,6 42,7 40,9 15,10 33.5,11 7.785,12 1.011,13 311.39,14 17,15 23,16 25,17 3,18 5.523}
{0 CHEMBL23569,1 13,2 29.273,3 28.246,4 45.451,5 51.315,6 47,7 45,9 17,10 35.5,11 7.565,12 1.01,13 340.43,14 20,15 25,16 27,17 4,18 7.475}
{0 CHEMBL23584,1 17,2 30.245,3 28.455,4 41.887,5 46.903,6 45,7 42,9 19,10 39,11 8.273,12 0.997,13 347.48,14 17,15 25,16 28,17 2,18 6.538}
{0 CHEMBL23657,1 12,2 26.301,3 25.499,4 40.458,5 45.774,6 42,7 40,9 15,10 33.5,11 7.785,12 1.011,13 311.39,14 17,15 23,16 25,17 3,18 4.801}
{0 CHEMBL23658,1 12,2 23.745,3 23.171,4 36.582,5 40.986,6 38,7 36,9 14,10 31,11 7.926,12 1.016,13 285.34,14 15,15 21,16 23,17 2,18 4.504}
{0 CHEMBL23705,1 13,2 31.034,3 29.772,4 48.334,5 54.73,6 50,7 48,9 18,10 36.5,11 7.385,12 1.007,13 354.46,14 22,15 26,16 28,17 5,18 6.292}
{0 CHEMBL23713,1 13,2 28.819,3 27.531,4 44.123,5 50.106,6 46,7 44,9 17,10 34.5,11 7.373,12 1.003,13 324.43,14 20,15 24,16 26,17 4,18 7.42}
{0 CHEMBL23787,1 12,2 23.824,3 22.723,4 32.662,5 36.099,6 34,7 32,9 13,10 31.5,11 9.963,12 1.021,13 318.82,14 11,15 21,16 23,17 1,18 4.376}
{0 CHEMBL23844,1 13,2 34.557,3 32.826,4 54.101,5 61.561,6 56,7 54,9 20,10 38.5,11 7.084,12 1.002,13 382.52,14 26,15 28,16 30,17 7,18 5.509}
{0 CHEMBL23846,1 16,2 26.29,3 25.456,4 38.254,5 42.777,6 41,7 38,9 17,10 36.5,11 8.036,12 1.007,13 305.37,14 15,15 23,16 26,17 1,18 4.87}
{0 CHEMBL23867,1 17,2 29.603,3 28.289,4 42.912,5 48.481,6 46,7 43,9 19,10 39,11 7.684,12 0.998,13 330.43,14 18,15 25,16 28,17 2,18 6.242}
{0 CHEMBL23911,1 13,2 27.699,3 26.17,4 40.214,5 45.112,6 42,7 40,9 16,10 33.5,11 8.186,12 1.005,13 327.45,14 17,15 23,16 25,17 3,18 6.252}
{0 CHEMBL23919,1 12,2 26.756,3 26.213,4 41.785,5 46.983,6 43,7 41,9 15,10 34.5,11 7.985,12 1.019,13 327.39,14 17,15 24,16 26,17 3,18 6.018}
{0 CHEMBL23960,1 18,2 29.051,3 27.983,4 42.138,5 47.192,6 45,7 42,9 19,10 39,11 7.891,12 1.003,13 331.41,14 17,15 25,16 28,17 1,18 5.114}
{0 CHEMBL23963,1 13,2 28.631,3 28.681,4 45.661,5 51.125,6 46,7 44,9 17,10 37.5,11 8.6,12 1.038,13 378.4,14 17,15 27,16 29,17 4,18 7.699}
{0 CHEMBL24007,1 13,2 26.341,3 24.756,4 36.327,5 40.432,6 38,7 36,9 15,10 32.5,11 9.218,12 1.009,13 331.86,14 14,15 22,16 24,17 2,18 7.167}
{0 CHEMBL24344,1 13,2 27.245,3 25.455,4 38.887,5 43.903,6 41,7 39,9 16,10 32.5,11 7.986,12 0.997,13 311.45,14 17,15 22,16 24,17 3,18 6.276}
{0 CHEMBL26006,1 16,2 27.086,3 26.257,4 39.247,5 44.149,6 42,7 39,9 17,10 38,11 8.138,12 1.006,13 317.39,14 15,15 24,16 27,17 1,18 6.886}
{0 CHEMBL264386,1 13,2 28.819,3 27.531,4 44.123,5 50.106,6 46,7 44,9 17,10 34.5,11 7.373,12 1.003,13 324.43,14 20,15 24,16 26,17 4,18 7.456}
{0 CHEMBL264548,1 10,2 35.074,3 32.858,4 55.767,5 63.893,6 58,7 56,9 20,10 35,11 6.635,12 0.996,13 371.54,14 29,15 27,16 29,17 10,18 6.496}
{0 CHEMBL266024,1 10,2 26.381,3 26.165,4 42.341,5 47.543,6 43,7 41,9 16,10 32,11 8.253,12 1.033,13 338.37,14 17,15 24,16 26,17 6,18 7}
{0 CHEMBL267207,1 8,2 23.239,3 21.434,4 33.785,5 38.404,6 36,7 34,9 13,10 25.5,11 7.659,12 0.994,13 260.4,14 16,15 18,16 20,17 5,18 6.678}
{0 CHEMBL267437,1 10,2 25.927,3 25.45,4 41.014,5 46.334,6 42,7 40,9 16,10 31,11 8.059,12 1.025,13 322.37,14 17,15 23,16 25,17 6,18 6.398}
{0 CHEMBL267616,1 10,2 28.784,3 27.256,4 45.014,5 51.149,6 47,7 45,9 17,10 31,11 6.987,12 1,13 314.43,14 22,15 23,16 25,17 7,18 7}
{0 CHEMBL267692,1 8,2 26.881,3 24.848,4 42.461,5 49.228,6 44,7 43,8 2,9 15,10 26,11 6.359,12 0.987,13 273.43,14 23,15 20,16 21,17 7,18 6.67}
{0 CHEMBL268355,1 10,2 26.569,3 25.015,4 40.803,5 46.524,6 43,7 41,9 16,10 29,11 6.937,12 0.995,13 284.4,14 20,15 21,16 23,17 6,18 6.569}
{0 CHEMBL268356,1 9,2 25.267,3 24.224,4 40.349,5 45.817,6 41,7 40,8 3,9 14,10 28,11 7.234,12 1.009,13 289.38,14 19,15 21,16 22,17 5,18 5.63}
{0 CHEMBL268870,1 10,2 26.569,3 25.015,4 40.803,5 46.524,6 43,7 41,9 16,10 29,11 6.937,12 0.995,13 284.4,14 20,15 21,16 23,17 6,18 6.347}
{0 CHEMBL274278,1 12,2 23.244,3 22.584,4 33.018,5 36.25,6 34,7 32,9 13,10 31,11 10.131,12 1.032,13 324.19,14 11,15 21,16 23,17 1,18 4.456}
{0 CHEMBL276954,1 16,2 27.841,3 26.762,4 40.029,5 45.066,6 43,7 40,9 18,10 38,11 7.91,12 1.001,13 316.4,14 16,15 24,16 27,17 2,18 4.013}
{0 CHEMBL277217,1 13,2 27.699,3 26.17,4 40.214,5 45.112,6 42,7 40,9 16,10 33.5,11 8.186,12 1.005,13 327.45,14 17,15 23,16 25,17 3,18 6.469}
{0 CHEMBL277438,1 12,2 23.244,3 22.584,4 33.018,5 36.25,6 34,7 32,9 13,10 31,11 10.131,12 1.032,13 324.19,14 11,15 21,16 23,17 1,18 4.293}
{0 CHEMBL278013,1 12,2 25.557,3 24.417,4 36.676,5 40.954,6 38,7 36,9 14,10 32,11 9.368,12 1.019,13 337.24,14 14,15 22,16 24,17 2,18 4.548}
{0 CHEMBL278515,1 15,2 34.852,3 34.632,4 55.643,5 61.568,6 56,7 54,8 3,9 20,10 45,11 8.194,12 1.03,13 442.48,14 22,15 32,16 34,17 5,18 7.456}
{0 CHEMBL279243,1 12,2 22.966,3 21.896,4 32.338,5 36.155,6 34,7 32,9 13,10 30.5,11 8.887,12 1.011,13 284.38,14 12,15 20,16 22,17 1,18 5.022}
{0 CHEMBL279679,1 13,2 32.796,3 31.299,4 51.218,5 58.145,6 53,7 51,9 19,10 37.5,11 7.225,12 1.004,13 368.49,14 24,15 27,16 29,17 6,18 6.903}
{0 CHEMBL279680,1 13,2 31.034,3 29.772,4 48.334,5 54.73,6 50,7 48,9 18,10 36.5,11 7.385,12 1.007,13 354.46,14 22,15 26,16 28,17 5,18 6.495}
{0 CHEMBL279705,1 13,2 28.819,3 27.531,4 44.123,5 50.106,6 46,7 44,9 17,10 34.5,11 7.373,12 1.003,13 324.43,14 20,15 24,16 26,17 4,18 7.167}
{0 CHEMBL279914,1 16,2 26.29,3 25.456,4 38.254,5 42.777,6 41,7 38,9 17,10 36.5,11 8.036,12 1.007,13 305.37,14 15,15 23,16 26,17 1,18 4.387}
{0 CHEMBL279983,1 13,2 29.273,3 28.246,4 45.451,5 51.315,6 47,7 45,9 17,10 35.5,11 7.565,12 1.01,13 340.43,14 20,15 25,16 27,17 4,18 6.5}
{0 CHEMBL280378,1 14,2 31.79,3 30.278,4 49.116,5 55.647,6 51,7 49,9 19,10 36.5,11 7.214,12 1.002,13 353.47,14 23,15 26,16 28,17 5,18 5.554}
{0 CHEMBL280726,1 8,2 39.665,3 36.251,4 63.974,5 74.344,6 66,7 65,8 2,9 22,10 34,11 5.964,12 0.984,13 387.64,14 37,15 28,16 29,17 14,18 7.73}
{0 CHEMBL281131,1 13,2 28.819,3 27.531,4 44.123,5 50.106,6 46,7 44,9 17,10 34.5,11 7.373,12 1.003,13 324.43,14 20,15 24,16 26,17 4,18 6}
{0 CHEMBL281618,1 8,2 37.381,3 34.67,4 58.323,5 67.099,6 63,7 59,8 2,9 22,10 37,11 6.467,12 0.989,13 381.58,14 31,15 28,16 32,17 14,18 7.77}
{0 CHEMBL281648,1 13,2 28.631,3 28.681,4 45.661,5 51.125,6 46,7 44,9 17,10 37.5,11 8.6,12 1.038,13 378.4,14 17,15 27,16 29,17 4,18 7.357}
{0 CHEMBL281803,1 13,2 31.034,3 29.772,4 48.334,5 54.73,6 50,7 48,9 18,10 36.5,11 7.385,12 1.007,13 354.46,14 22,15 26,16 28,17 5,18 6.666}
{0 CHEMBL281962,1 12,2 27.767,3 26.638,4 39.785,5 44.08,6 42,7 39,9 16,10 35,11 9.34,12 1.02,13 364.26,14 15,15 24,16 27,17 4,18 4.393}
{0 CHEMBL282677,1 8,2 23.813,3 22.509,4 38.022,5 43.607,6 39,7 38,8 2,9 13,10 25,11 6.878,12 1.001,13 261.37,14 19,15 19,16 20,17 5,18 5.2}
{0 CHEMBL282932,1 14,2 33.097,3 31.09,4 50.672,5 57.853,6 53,7 51,8 2,9 20,10 36,11 6.892,12 0.994,13 351.5,14 25,15 26,16 28,17 6,18 8.38}
{0 CHEMBL282948,1 13,2 31.125,3 29.343,4 46.68,5 53.311,6 50,7 47,9 19,10 36.5,11 7.116,12 0.993,13 334.47,14 22,15 25,16 28,17 6,18 7}
{0 CHEMBL283311,1 16,2 26.932,3 25.622,4 37.229,5 41.199,6 40,7 37,9 17,10 36.5,11 8.714,12 1.006,13 322.42,14 14,15 23,16 26,17 1,18 6.187}
{0 CHEMBL283515,1 16,2 26.932,3 25.622,4 37.229,5 41.199,6 40,7 37,9 17,10 36.5,11 8.714,12 1.006,13 322.42,14 14,15 23,16 26,17 1,18 4.721}
{0 CHEMBL283518,1 13,2 29.273,3 28.246,4 45.451,5 51.315,6 47,7 45,9 17,10 35.5,11 7.565,12 1.01,13 340.43,14 20,15 25,16 27,17 4,18 7.325}
{0 CHEMBL283740,1 14,2 30.819,3 29.531,4 46.123,5 52.106,6 48,7 46,8 2,9 19,10 38,11 7.575,12 1.003,13 348.45,14 20,15 26,16 28,17 4,18 8.08}
{0 CHEMBL284544,1 13,2 30.029,3 28.751,4 46.232,5 52.232,6 48,7 46,9 18,10 35.5,11 7.379,12 1.005,13 339.44,14 21,15 25,16 27,17 5,18 6.469}
{0 CHEMBL284839,1 17,2 35.455,3 34.213,4 54.552,5 60.983,6 56,7 54,8 1,9 22,10 42,11 7.565,12 1.01,13 408.5,14 24,15 30,16 32,17 5,18 5.959}
{0 CHEMBL284849,1 13,2 29.728,3 28.96,4 46.778,5 52.524,6 48,7 46,9 17,10 36.5,11 7.748,12 1.017,13 356.43,14 20,15 26,16 28,17 4,18 5.26}
{0 CHEMBL284960,1 12,2 30.483,3 29.466,4 47.56,5 53.441,6 50,7 47,9 18,10 37,11 7.563,12 1.012,13 355.44,14 21,15 26,16 29,17 6,18 4.642}
{0 CHEMBL285279,1 11,2 29.239,3 27.971,4 46.342,5 52.358,6 47,7 46,8 1,9 17,10 32,11 7.183,12 1.007,13 330.43,14 22,15 24,16 25,17 6,18 6.824}
{0 CHEMBL286700,1 13,2 23.08,3 22.236,4 34.145,5 38.651,6 36,7 34,9 14,10 30.5,11 7.834,12 1.004,13 266.34,14 14,15 20,16 22,17 1,18 5.569}
{0 CHEMBL286820,1 12,2 24.728,3 23.423,4 35.222,5 39.571,6 37,7 35,9 14,10 31.5,11 8.526,12 1.006,13 298.41,14 14,15 21,16 23,17 2,18 4.674}
{0 CHEMBL287240,1 12,2 32.699,3 31.707,4 51.771,5 58.066,6 54,7 51,9 19,10 39,11 7.558,12 1.015,13 385.47,14 23,15 28,16 31,17 7,18 4.456}
{0 CHEMBL287511,1 12,2 27.512,3 26.719,4 42.567,5 47.9,6 44,7 42,9 16,10 34.5,11 7.771,12 1.014,13 326.4,14 18,15 24,16 26,17 4,18 4.955}
{0 CHEMBL287579,1 12,2 27.767,3 26.638,4 39.785,5 44.08,6 42,7 39,9 16,10 35,11 9.34,12 1.02,13 364.26,14 15,15 24,16 27,17 4,18 4.646}
{0 CHEMBL288350,1 11,2 32.762,3 31.025,4 52.109,5 59.189,6 53,7 52,8 1,9 19,10 34,11 6.894,12 1.002,13 358.49,14 26,15 26,16 27,17 8,18 6.276}
{0 CHEMBL288647,1 17,2 31.932,3 31.159,4 48.785,5 54.152,6 50,7 48,8 1,9 20,10 40,11 7.926,12 1.016,13 380.44,14 20,15 28,16 30,17 3,18 6.051}
{0 CHEMBL289908,1 17,2 35.455,3 34.213,4 54.552,5 60.983,6 56,7 54,8 1,9 22,10 42,11 7.565,12 1.01,13 408.5,14 24,15 30,16 32,17 5,18 5.108}
{0 CHEMBL290806,1 17,2 31.932,3 31.159,4 48.785,5 54.152,6 50,7 48,8 1,9 20,10 40,11 7.926,12 1.016,13 380.44,14 20,15 28,16 30,17 3,18 5.921}
{0 CHEMBL291239,1 13,2 25.483,3 23.928,4 36.003,5 40.488,6 38,7 36,9 15,10 31.5,11 8.262,12 1,13 297.42,14 15,15 21,16 23,17 2,18 6.357}
{0 CHEMBL292143,1 17,2 28.483,3 26.928,4 39.003,5 43.488,6 42,7 39,9 18,10 38,11 8.55,12 1,13 333.45,14 15,15 24,16 27,17 1,18 6.42}
{0 CHEMBL292212,1 13,2 24.796,3 23.891,4 34.793,5 38.539,6 36,7 34,9 14,10 32.5,11 9.859,12 1.023,13 335.22,14 12,15 22,16 24,17 1,18 5.796}
{0 CHEMBL292427,1 13,2 24.796,3 23.891,4 34.793,5 38.539,6 36,7 34,9 14,10 32.5,11 9.859,12 1.023,13 335.22,14 12,15 22,16 24,17 1,18 6.387}
{0 CHEMBL292634,1 13,2 24.796,3 23.891,4 34.793,5 38.539,6 36,7 34,9 14,10 32.5,11 9.859,12 1.023,13 335.22,14 12,15 22,16 24,17 1,18 6.137}
{0 CHEMBL293258,1 4,2 20.898,3 20.846,4 35.098,5 37.887,6 34,7 33,8 4,9 9,10 25,11 9.34,12 1.064,13 308.21,14 13,15 20,16 21,17 5,18 4.921}
{0 CHEMBL293265,1 10,2 29.682,3 28.38,4 45.549,5 51.548,6 47,7 45,8 1,9 16,10 34,11 8.042,12 1.012,13 361.88,14 20,15 25,16 27,17 6,18 5.328}
{0 CHEMBL293321,1 10,2 30.989,3 29.192,4 47.105,5 53.754,6 49,7 47,8 1,9 17,10 34,11 7.658,12 1.002,13 359.91,14 22,15 25,16 27,17 7,18 4.394}
{0 CHEMBL293415,1 12,2 29.938,3 29.181,4 47.887,5 53.651,6 49,7 47,9 17,10 36,11 7.647,12 1.019,13 359.43,14 21,15 26,16 28,17 5,18 4.347}
{0 CHEMBL293512,1 14,2 32.182,3 31.675,4 50.105,5 55.734,6 52,7 49,8 4,9 19,10 42,11 8.091,12 1.023,13 396.45,14 20,15 29,16 32,17 5,18 5.369}
{0 CHEMBL293822,1 10,2 29.989,3 28.192,4 46.105,5 52.754,6 47,7 46,8 1,9 16,10 32,11 7.563,12 1.002,13 347.9,14 22,15 24,16 25,17 6,18 5.119}
{0 CHEMBL294131,1 12,2 25.96,3 25.412,4 40.793,5 45.611,6 42,7 40,9 15,10 33,11 7.884,12 1.02,13 315.37,14 17,15 23,16 25,17 3,18 4.796}
{0 CHEMBL294468,1 10,2 29.989,3 28.192,4 46.105,5 52.754,6 47,7 46,8 1,9 16,10 32,11 7.563,12 1.002,13 347.9,14 22,15 24,16 25,17 6,18 4.991}
{0 CHEMBL296382,1 13,2 27.512,3 26.719,4 42.567,5 47.9,6 44,7 42,9 16,10 34.5,11 7.771,12 1.014,13 326.4,14 18,15 24,16 26,17 3,18 5.26}
{0 CHEMBL298538,1 16,2 36.205,3 34.433,4 54.316,5 61.378,6 56,7 54,8 1,9 21,10 42,11 7.888,12 1.006,13 425.97,14 24,15 30,16 32,17 5,18 6.585}
{0 CHEMBL298819,1 10,2 34.421,3 32.675,4 54.527,5 62.003,6 55,7 54,8 1,9 18,10 36,11 7.555,12 1.01,13 407.96,14 26,15 28,16 29,17 8,18 6.041}
{0 CHEMBL299045,1 10,2 22.182,3 21.558,4 32.687,5 36.678,6 33,7 32,8 2,9 12,10 29,11 9.055,12 1.021,13 289.76,14 12,15 20,16 21,17 2,18 5.876}
{0 CHEMBL299140,1 17,2 27.841,3 26.762,4 40.029,5 45.066,6 43,7 40,9 18,10 38,11 7.91,12 1.001,13 316.4,14 16,15 24,16 27,17 1,18 6.638}
{0 CHEMBL299174,1 13,2 29.273,3 28.246,4 45.451,5 51.315,6 47,7 45,9 17,10 35.5,11 7.565,12 1.01,13 340.43,14 20,15 25,16 27,17 4,18 6.796}
{0 CHEMBL299927,1 10,2 34.012,3 32.541,4 54.429,5 61.77,6 57,7 54,9 19,10 37,11 7.158,12 1.008,13 386.51,14 26,15 28,16 31,17 9,18 5.658}
{0 CHEMBL300419,1 11,2 31.693,3 30.686,4 49.669,5 55.568,6 50,7 49,8 1,9 19,10 37,11 7.56,12 1.014,13 370.45,14 22,15 27,16 28,17 6,18 9}
{0 CHEMBL300603,1 13,2 26.557,3 25.417,4 37.676,5 41.954,6 39,7 37,9 15,10 33.5,11 9.439,12 1.018,13 349.25,14 14,15 23,16 25,17 2,18 7.42}
{0 CHEMBL300876,1 10,2 29.989,3 28.192,4 46.105,5 52.754,6 47,7 46,8 1,9 16,10 32,11 7.563,12 1.002,13 347.9,14 22,15 24,16 25,17 6,18 4.533}
{0 CHEMBL300886,1 13,2 23.722,3 22.401,4 33.12,5 37.072,6 35,7 33,9 14,10 30.5,11 8.588,12 1.004,13 283.39,14 13,15 20,16 22,17 1,18 5.699}
{0 CHEMBL301105,1 13,2 29.273,3 28.246,4 45.451,5 51.315,6 47,7 45,9 17,10 35.5,11 7.565,12 1.01,13 340.43,14 20,15 25,16 27,17 4,18 6.678}
{0 CHEMBL301769,1 20,2 31.847,3 30.784,4 45.131,5 50.564,6 49,7 45,8 1,9 21,10 44.5,11 8.166,12 1.003,13 367.45,14 17,15 28,16 32,17 1,18 6.678}
{0 CHEMBL302633,1 12,2 25.96,3 25.412,4 40.793,5 45.611,6 42,7 40,9 15,10 33,11 7.884,12 1.02,13 315.37,14 17,15 23,16 25,17 3,18 4.328}
{0 CHEMBL303102,1 12,2 23.244,3 22.584,4 33.018,5 36.25,6 34,7 32,9 13,10 31,11 10.131,12 1.032,13 324.19,14 11,15 21,16 23,17 1,18 4.824}
{0 CHEMBL30403,1 12,2 26.051,3 24.983,4 39.138,5 44.192,6 42,7 39,9 16,10 33,11 7.574,12 1.004,13 295.38,14 17,15 22,16 25,17 4,18 5.046}
{0 CHEMBL306731,1 15,2 24.739,3 24.149,4 36.48,5 40.488,6 38,7 36,8 1,9 16,10 33.5,11 8.176,12 1.013,13 294.34,14 14,15 22,16 24,17 1,18 5.602}
{0 CHEMBL309371,1 8,2 15.761,3 15.381,4 24.385,5 27.448,6 25,7 24,9 9,10 20.5,11 7.926,12 1.016,13 190.23,14 10,15 14,16 15,17 1,18 4.287}
{0 CHEMBL309784,1 13,2 23.227,3 23.138,4 34.916,5 38.654,6 36,7 34,8 1,9 14,10 33.5,11 8.715,12 1.027,13 296.32,14 12,15 22,16 24,17 1,18 5.009}
{0 CHEMBL309792,1 15,2 31.387,3 30.874,4 49.113,5 54.362,6 50,7 48,8 1,9 19,10 39.5,11 8.009,12 1.023,13 384.43,14 20,15 28,16 30,17 4,18 5.854}
{0 CHEMBL309966,1 13,2 27.461,3 26.117,4 40.236,5 45.425,6 42,7 40,9 16,10 33.5,11 8.221,12 1.006,13 328.84,14 17,15 23,16 25,17 3,18 7.076}
{0 CHEMBL310397,1 21,2 35.972,3 35.455,4 52.996,5 58.608,6 56,7 52,8 2,9 23,10 50.5,11 8.49,12 1.019,13 441.49,14 19,15 33,16 37,17 2,18 7.678}
{0 CHEMBL310807,1 15,2 29.171,3 28.632,4 44.902,5 49.737,6 46,7 44,8 1,9 18,10 37.5,11 8.055,12 1.02,13 354.4,14 18,15 26,16 28,17 3,18 6.292}
{0 CHEMBL310880,1 13,2 27.461,3 26.117,4 40.236,5 45.425,6 42,7 40,9 16,10 33.5,11 8.221,12 1.006,13 328.84,14 17,15 23,16 25,17 3,18 7.097}
{0 CHEMBL311432,1 7,2 16.767,3 16.402,4 26.487,5 29.947,6 27,7 26,9 9,10 21.5,11 7.894,12 1.019,13 205.25,14 11,15 15,16 16,17 2,18 4.979}
{0 CHEMBL312348,1 13,2 27.057,3 26.004,4 41.24,5 46.69,6 43,7 41,9 16,10 33.5,11 7.571,12 1.006,13 310.4,14 18,15 23,16 25,17 3,18 7.02}
{0 CHEMBL312688,1 11,2 20.273,3 19.837,4 28.025,5 30.708,6 29,7 27,9 11,10 29,11 10.931,12 1.038,13 295.15,14 8,15 19,16 21,18 4.71}
{0 CHEMBL31273,1 12,2 27.767,3 26.638,4 39.785,5 44.08,6 42,7 39,9 16,10 35,11 9.34,12 1.02,13 364.26,14 15,15 24,16 27,17 4,18 4.618}
{0 CHEMBL317017,1 12,2 27.245,3 25.455,4 38.887,5 43.903,6 42,7 39,9 16,10 33,11 7.986,12 0.997,13 311.45,14 17,15 22,16 25,17 4,18 5.284}
{0 CHEMBL317618,1 10,2 17.801,3 17.677,4 26.596,5 29.903,6 28,7 26,9 10,10 27,11 8.741,12 1.023,13 227.26,14 9,15 17,16 19,18 4.745}
{0 CHEMBL318601,1 11,2 20.273,3 19.837,4 28.025,5 30.708,6 29,7 27,9 11,10 29,11 10.931,12 1.038,13 295.15,14 8,15 19,16 21,18 4.959}
{0 CHEMBL31891,1 10,2 23.853,3 22.701,4 35.593,5 39.745,6 36,7 35,9 13,10 27,11 9.692,12 1.017,13 339.22,14 15,15 20,16 21,17 3,18 7.509}
{0 CHEMBL32039,1 10,2 28.693,3 27.686,4 46.669,5 52.568,6 47,7 46,9 16,10 31,11 7.27,12 1.015,13 334.42,14 22,15 24,16 25,17 6,18 4.201}
{0 CHEMBL32113,1 13,2 29.273,3 28.246,4 45.451,5 51.315,6 47,7 45,9 17,10 35.5,11 7.565,12 1.01,13 340.43,14 20,15 25,16 27,17 4,18 7.076}
{0 CHEMBL32190,1 13,2 31.489,3 30.487,4 49.662,5 55.94,6 51,7 49,9 18,10 37.5,11 7.56,12 1.014,13 370.46,14 22,15 27,16 29,17 5,18 7.215}
{0 CHEMBL32220,1 17,2 30.057,3 29.004,4 44.24,5 49.69,6 47,7 44,9 19,10 40,11 7.873,12 1.005,13 346.43,14 18,15 26,16 29,17 2,18 5.086}
{0 CHEMBL322585,1 12,2 29.671,3 27.917,4 44.207,5 49.654,6 46,7 44,9 17,10 34,11 7.829,12 1.005,13 344.48,14 20,15 24,16 26,17 5,18 5.921}
{0 CHEMBL32266,1 13,2 27.512,3 26.719,4 42.567,5 47.9,6 44,7 42,9 16,10 34.5,11 7.771,12 1.014,13 326.4,14 18,15 24,16 26,17 3,18 5.244}
{0 CHEMBL323359,1 17,2 33.733,3 32.982,4 51.88,5 58.023,6 53,7 51,8 3,9 20,10 44,11 7.99,12 1.017,13 407.48,14 21,15 30,16 32,17 3,18 6.276}
{0 CHEMBL325434,1 14,2 30.029,3 28.751,4 46.232,5 52.232,6 48,7 46,9 18,10 35.5,11 7.379,12 1.005,13 339.44,14 21,15 25,16 27,17 4,18 7.06}
{0 CHEMBL32583,1 13,2 31.489,3 30.487,4 49.662,5 55.94,6 51,7 49,9 18,10 37.5,11 7.56,12 1.014,13 370.46,14 22,15 27,16 29,17 5,18 5.036}
{0 CHEMBL32635,1 17,2 27.841,3 26.762,4 40.029,5 45.066,6 43,7 40,9 18,10 38,11 7.91,12 1.001,13 316.4,14 16,15 24,16 27,17 1,18 5.409}
{0 CHEMBL32708,1 13,2 27.512,3 26.719,4 42.567,5 47.9,6 44,7 42,9 16,10 34.5,11 7.771,12 1.014,13 326.4,14 18,15 24,16 26,17 3,18 5.42}
{0 CHEMBL32754,1 13,2 29.728,3 28.96,4 46.778,5 52.524,6 48,7 46,9 17,10 36.5,11 7.748,12 1.017,13 356.43,14 20,15 26,16 28,17 4,18 4.684}
{0 CHEMBL32769,1 13,2 27.512,3 26.719,4 42.567,5 47.9,6 44,7 42,9 16,10 34.5,11 7.771,12 1.014,13 326.4,14 18,15 24,16 26,17 3,18 5.319}
{0 CHEMBL328897,1 14,2 33.103,3 31.82,4 50.767,5 56.801,6 52,7 50,9 19,10 38.5,11 8.078,12 1.015,13 403.91,14 22,15 28,16 30,17 5,18 7.921}
{0 CHEMBL33038,1 13,2 24.841,3 23.762,4 37.029,5 42.066,6 39,7 37,9 15,10 31.5,11 7.578,12 1.001,13 280.37,14 16,15 21,16 23,17 2,18 7.167}
{0 CHEMBL331292,1 8,2 25.478,3 24.444,4 41.458,5 46.943,6 42,7 41,8 2,9 14,10 27,11 7.131,12 1.011,13 292.38,14 20,15 21,16 22,17 6,18 4.921}
{0 CHEMBL331314,1 12,2 24.938,3 23.643,4 36.331,5 40.697,6 38,7 36,9 14,10 31,11 8.372,12 1.009,13 301.41,14 15,15 21,16 23,17 2,18 4.658}
{0 CHEMBL331351,1 16,2 31.557,3 29.63,4 40.982,5 44.715,6 43,7 40,9 17,10 40.5,11 12.106,12 1.025,13 484.23,14 13,15 27,16 30,17 1,18 5.125}
{0 CHEMBL33136,1 13,2 24.841,3 23.762,4 37.029,5 42.066,6 39,7 37,9 15,10 31.5,11 7.578,12 1.001,13 280.37,14 16,15 21,16 23,17 2,18 5.712}
{0 CHEMBL331456,1 12,2 24.438,3 23.056,4 32.767,5 35.96,6 34,7 32,9 13,10 31,11 10.633,12 1.024,13 340.26,14 11,15 21,16 23,17 1,18 4.921}
{0 CHEMBL331682,1 12,2 30.722,3 29.151,4 44.982,5 49.788,6 46,7 44,9 16,10 36,11 10.008,12 1.022,13 440.36,14 18,15 26,16 28,17 4,18 4.886}
{0 CHEMBL33187,1 19,2 31.057,3 30.004,4 45.24,5 50.69,6 48,7 45,9 20,10 41.5,11 7.965,12 1.005,13 358.44,14 18,15 27,16 30,17 1,18 4.614}
{0 CHEMBL331986,1 12,2 27.154,3 25.885,4 40.542,5 45.322,6 42,7 40,9 15,10 33,11 8.286,12 1.014,13 331.44,14 17,15 23,16 25,17 3,18 4.836}
{0 CHEMBL33208,1 13,2 29.728,3 28.96,4 46.778,5 52.524,6 48,7 46,9 17,10 36.5,11 7.748,12 1.017,13 356.43,14 20,15 26,16 28,17 4,18 4.851}
{0 CHEMBL33357,1 17,2 30.057,3 29.004,4 44.24,5 49.69,6 47,7 44,9 19,10 40,11 7.873,12 1.005,13 346.43,14 18,15 26,16 29,17 2,18 4.812}
{0 CHEMBL333791,1 10,2 27.074,3 25.45,4 39.342,5 44.286,6 41,7 39,9 15,10 30,11 8.674,12 1.009,13 338.27,14 17,15 22,16 24,17 5,18 6.299}
{0 CHEMBL334198,1 12,2 23.58,3 22.229,4 32.444,5 36.016,6 34,7 32,9 13,10 30,11 9.557,12 1.014,13 305.82,14 12,15 20,16 22,17 1,18 4.368}
{0 CHEMBL334271,1 14,2 28.869,3 27.96,4 40.327,5 44.107,6 41,7 39,8 1,9 16,10 37.5,11 10.556,12 1.034,13 411.7,14 13,15 26,16 28,17 2,18 6.284}
{0 CHEMBL334456,1 17,2 27.841,3 26.762,4 40.029,5 45.066,6 43,7 40,9 18,10 38,11 7.91,12 1.001,13 316.4,14 16,15 24,16 27,17 1,18 5.292}
{0 CHEMBL33677,1 8,2 30.858,3 28.617,4 49.556,5 57.268,6 51,7 50,8 2,9 17,10 29,11 6.35,12 0.991,13 317.49,14 27,15 23,16 24,17 9,18 7}
{0 CHEMBL337603,1 13,2 27.512,3 26.719,4 42.567,5 47.9,6 44,7 42,9 16,10 34.5,11 7.771,12 1.014,13 326.4,14 18,15 24,16 26,17 3,18 8.638}
{0 CHEMBL337746,1 13,2 25.085,3 24.546,4 37.102,5 40.701,6 38,7 36,8 2,9 14,10 35.5,11 9.205,12 1.031,13 331.39,14 13,15 23,16 25,17 1,18 5.495}
{0 CHEMBL33921,1 11,2 31,3 29.498,4 49.225,5 55.773,6 50,7 49,8 1,9 18,10 33,11 7.03,12 1.005,13 344.46,14 24,15 25,16 26,17 7,18 6.824}
{0 CHEMBL33922,1 11,2 31.239,3 29.971,4 48.342,5 54.358,6 49,7 48,8 1,9 19,10 36,11 7.384,12 1.007,13 354.45,14 22,15 26,16 27,17 6,18 6.06}
{0 CHEMBL34158,1 8,2 20.29,3 19.456,4 32.254,5 36.777,6 33,7 32,8 2,9 11,10 23,11 7.291,12 1.008,13 233.31,14 15,15 17,16 18,17 3,18 5.6}
{0 CHEMBL341703,1 14,2 24.591,3 23.246,4 35.709,5 40.484,6 38,7 36,9 16,10 30.5,11 7.343,12 0.992,13 264.36,14 16,15 20,16 22,17 2,18 5.495}
{0 CHEMBL342086,1 18,2 32.608,3 31.311,4 47.014,5 52.979,6 51,7 47,9 21,10 43.5,11 7.861,12 1,13 369.47,14 19,15 28,16 32,17 3,18 5.854}
{0 CHEMBL342555,1 14,2 31.182,3 30.675,4 49.105,5 54.734,6 50,7 48,8 1,9 18,10 39.5,11 8.009,12 1.023,13 384.44,14 20,15 28,16 30,17 4,18 4.733}
{0 CHEMBL34259,1 15,2 35.648,3 35.433,4 56.636,5 62.94,6 57,7 55,8 3,9 20,10 46.5,11 8.264,12 1.03,13 454.5,14 22,15 33,16 35,17 5,18 8.923}
{0 CHEMBL342654,1 13,2 25.085,3 24.546,4 37.102,5 40.701,6 38,7 36,8 2,9 14,10 35.5,11 9.205,12 1.031,13 331.39,14 13,15 23,16 25,17 1,18 4.979}
{0 CHEMBL34293,1 17,2 31.716,3 30.918,4 46.574,5 51.528,6 48,7 46,8 1,9 21,10 42,11 8.14,12 1.012,13 374.43,14 18,15 28,16 30,17 2,18 5.886}
{0 CHEMBL34337,1 13,2 26.603,3 25.289,4 39.912,5 45.481,6 42,7 40,9 16,10 32.5,11 7.36,12 0.998,13 294.4,14 18,15 22,16 24,17 3,18 5.745}
{0 CHEMBL34378,1 17,2 31.716,3 30.918,4 46.574,5 51.528,6 48,7 46,8 1,9 21,10 42,11 8.14,12 1.012,13 374.43,14 18,15 28,16 30,17 2,18 5.387}
{0 CHEMBL34641,1 19,2 34.693,3 33.686,4 52.669,5 58.568,6 54,7 52,8 2,9 22,10 43,11 7.817,12 1.013,13 406.48,14 22,15 30,16 32,17 3,18 5.066}
{0 CHEMBL34823,1 11,2 27.716,3 26.918,4 42.574,5 47.528,6 43,7 42,8 1,9 17,10 34,11 7.771,12 1.014,13 326.39,14 18,15 24,16 25,17 4,18 6.886}
{0 CHEMBL349149,1 14,2 29.023,3 27.73,4 44.131,5 49.734,6 46,7 44,9 18,10 34.5,11 7.373,12 1.003,13 324.42,14 20,15 24,16 26,17 4,18 4.721}
{0 CHEMBL35020,1 17,2 31.716,3 30.918,4 46.574,5 51.528,6 48,7 46,8 1,9 21,10 42,11 8.14,12 1.012,13 374.43,14 18,15 28,16 30,17 2,18 7.638}
{0 CHEMBL350730,1 14,2 28.267,3 27.224,4 43.349,5 48.817,6 45,7 43,9 17,10 34.5,11 7.568,12 1.008,13 325.41,14 19,15 24,16 26,17 3,18 5.301}
{0 CHEMBL35080,1 17,2 33.932,3 33.159,4 50.785,5 56.152,6 52,7 50,8 1,9 22,10 44,11 8.089,12 1.016,13 404.46,14 20,15 30,16 32,17 3,18 5.252}
{0 CHEMBL35222,1 13,2 31.489,3 30.487,4 49.662,5 55.94,6 51,7 49,9 18,10 37.5,11 7.56,12 1.014,13 370.46,14 22,15 27,16 29,17 5,18 7.102}
{0 CHEMBL35437,1 17,2 33.932,3 33.159,4 50.785,5 56.152,6 52,7 50,8 1,9 22,10 44,11 8.089,12 1.016,13 404.46,14 20,15 30,16 32,17 3,18 5.638}
{0 CHEMBL355151,1 14,2 23.068,3 22.193,4 31.942,5 35.654,6 34,7 32,9 16,10 32.5,11 8.135,12 0.998,13 260.32,14 12,15 20,16 22,18 4.523}
{0 CHEMBL35569,1 13,2 29.728,3 28.96,4 46.778,5 52.524,6 48,7 46,9 17,10 36.5,11 7.748,12 1.017,13 356.43,14 20,15 26,16 28,17 4,18 4.851}
{0 CHEMBL356490,1 13,2 33.25,3 32.014,4 52.545,5 59.355,6 54,7 52,9 19,10 38.5,11 7.394,12 1.01,13 384.49,14 24,15 28,16 30,17 6,18 6.721}
{0 CHEMBL356722,1 17,2 35.04,3 33.794,4 53.436,5 60.229,6 56,7 53,9 21,10 44,11 7.651,12 1.008,13 405.51,14 23,15 30,16 33,17 4,18 5.745}
{0 CHEMBL357573,1 10,2 26.466,3 25.138,4 40.338,5 45.923,6 41,7 40,8 1,9 14,10 30,11 7.996,12 1.008,13 319.84,14 18,15 22,16 23,17 4,18 5.407}
{0 CHEMBL357629,1 19,2 34.58,3 33.058,4 51.007,5 57.521,6 54,7 51,9 22,10 43.5,11 7.578,12 1,13 386.5,14 22,15 29,16 32,17 3,18 6.194}
{0 CHEMBL357973,1 13,2 32.034,3 30.772,4 49.334,5 55.73,6 52,7 49,9 19,10 38.5,11 7.479,12 1.007,13 366.47,14 22,15 27,16 30,17 6,18 4.854}
{0 CHEMBL358297,1 15,2 29.057,3 28.004,4 43.24,5 48.69,6 46,7 43,9 18,10 38.5,11 7.777,12 1.006,13 334.42,14 18,15 25,16 28,17 3,18 6.244}
{0 CHEMBL359454,1 13,2 29.819,3 28.531,4 45.123,5 51.106,6 48,7 45,9 18,10 36.5,11 7.476,12 1.003,13 336.44,14 20,15 25,16 28,17 5,18 6.538}
{0 CHEMBL36,1 10,2 20.688,3 19.547,4 30.149,5 34.013,6 31,7 30,9 12,10 24,11 8.291,12 1.005,13 248.74,14 13,15 17,16 18,17 2,18 5.496}
{0 CHEMBL36245,1 13,2 29.273,3 28.246,4 45.451,5 51.315,6 47,7 45,9 17,10 35.5,11 7.565,12 1.01,13 340.43,14 20,15 25,16 27,17 4,18 7.119}
{0 CHEMBL367266,1 8,2 29.097,3 27.09,4 46.672,5 53.853,6 48,7 47,8 2,9 16,10 28,11 6.457,12 0.993,13 303.46,14 25,15 22,16 23,17 8,18 6.59}
{0 CHEMBL367802,1 18,2 30.358,3 28.795,4 43.694,5 49.398,6 47,7 44,9 20,10 39,11 7.487,12 0.993,13 329.44,14 19,15 25,16 28,17 2,18 7.77}
{0 CHEMBL368269,1 8,2 21.483,3 19.928,4 32.003,5 36.488,6 33,7 32,8 2,9 11,10 23,11 7.793,12 1,13 249.38,14 15,15 17,16 18,17 3,18 5.8}
{0 CHEMBL368645,1 15,2 31.728,3 30.96,4 48.778,5 54.524,6 51,7 48,8 1,9 19,10 40.5,11 7.926,12 1.016,13 380.45,14 20,15 28,16 31,17 4,18 5.337}
{0 CHEMBL370239,1 14,2 33.483,3 32.466,4 50.56,5 56.441,6 52,7 50,8 1,9 21,10 42.5,11 7.829,12 1.011,13 391.47,14 21,15 29,16 31,17 5,18 9.187}
{0 CHEMBL37334,1 11,2 29.478,3 28.444,4 45.458,5 50.943,6 46,7 45,8 1,9 18,10 35,11 7.565,12 1.01,13 340.42,14 20,15 25,16 26,17 5,18 7.553}
{0 CHEMBL37520,1 11,2 29.693,3 28.686,4 47.669,5 53.568,6 48,7 47,8 1,9 17,10 33,11 7.371,12 1.014,13 346.43,14 22,15 25,16 26,17 6,18 7.268}
{0 CHEMBL37696,1 11,2 27.932,3 27.159,4 44.785,5 50.152,6 45,7 44,8 1,9 16,10 32,11 7.555,12 1.018,13 332.4,14 20,15 24,16 25,17 5,18 6.602}
{0 CHEMBL38158,1 17,2 33.239,3 31.971,4 50.342,5 56.358,6 52,7 50,8 1,9 21,10 40,11 7.569,12 1.007,13 378.47,14 22,15 28,16 30,17 4,18 5.149}
{0 CHEMBL409194,1 12,2 23.824,3 22.723,4 32.662,5 36.099,6 34,7 32,9 13,10 31.5,11 9.963,12 1.021,13 318.82,14 11,15 21,16 23,17 1,18 4.375}
{0 CHEMBL413323,1 10,2 31.995,3 30.213,4 49.207,5 56.252,6 51,7 49,8 1,9 17,10 35,11 7.652,12 1.004,13 374.93,14 23,15 26,16 28,17 7,18 5.071}
{0 CHEMBL414610,1 8,2 44.95,3 40.831,4 72.625,5 84.59,6 75,7 74,8 2,9 25,10 37,11 5.807,12 0.981,13 429.73,14 43,15 31,16 32,17 17,18 6.48}
{0 CHEMBL415962,1 13,2 27.057,3 26.004,4 41.24,5 46.69,6 43,7 41,9 16,10 33.5,11 7.571,12 1.006,13 310.4,14 18,15 23,16 25,17 3,18 6.602}
{0 CHEMBL417461,1 14,2 30.432,3 28.864,4 45.229,5 50.967,6 47,7 45,8 2,9 18,10 35,11 7.953,12 1.005,13 357.88,14 20,15 25,16 27,17 4,18 7.92}
{0 CHEMBL417746,1 17,2 27.841,3 26.762,4 40.029,5 45.066,6 43,7 40,9 18,10 38,11 7.91,12 1.001,13 316.4,14 16,15 24,16 27,17 1,18 5.796}
{0 CHEMBL418214,1 15,2 37.614,3 37.158,4 59.527,5 65.983,6 61,7 58,8 3,9 22,10 48,11 8.078,12 1.026,13 468.52,14 24,15 34,16 37,17 7,18 4.963}
{0 CHEMBL418502,1 12,2 23.244,3 22.584,4 33.018,5 36.25,6 34,7 32,9 13,10 31,11 10.131,12 1.032,13 324.19,14 11,15 21,16 23,17 1,18 4.602}
{0 CHEMBL418741,1 14,2 31.79,3 30.278,4 49.116,5 55.647,6 51,7 49,8 2,9 19,10 36,11 7.214,12 1.002,13 353.47,14 23,15 26,16 28,17 5,18 8.11}
{0 CHEMBL420172,1 12,2 23.58,3 22.229,4 32.444,5 36.016,6 34,7 32,9 13,10 30,11 9.557,12 1.014,13 305.82,14 12,15 20,16 22,17 1,18 4.777}
{0 CHEMBL420224,1 13,2 27.415,3 26.245,4 38,5 41.898,6 39,7 37,9 15,10 34.5,11 10.37,12 1.027,13 383.69,14 13,15 24,16 26,17 2,18 7.201}
{0 CHEMBL420332,1 10,2 33.767,3 32.046,4 54.211,5 61.687,6 56,7 54,9 19,10 35,11 6.917,12 1.004,13 373.51,14 27,15 27,16 29,17 9,18 4.733}
{0 CHEMBL420393,1 15,2 29.171,3 28.632,4 44.902,5 49.737,6 46,7 44,8 1,9 18,10 37.5,11 8.055,12 1.02,13 354.4,14 18,15 26,16 28,17 3,18 6.337}
{0 CHEMBL421053,1 10,2 33.012,3 31.541,4 53.429,5 60.77,6 55,7 53,9 18,10 35,11 7.066,12 1.008,13 374.5,14 26,15 27,16 29,17 8,18 5.432}
{0 CHEMBL421319,1 15,2 24.739,3 24.149,4 36.48,5 40.488,6 38,7 36,8 1,9 16,10 33.5,11 8.176,12 1.013,13 294.34,14 14,15 22,16 24,17 1,18 6.222}
{0 CHEMBL421594,1 11,2 22.989,3 22.665,4 35.8,5 40.069,6 37,7 35,9 13,10 31,11 8.181,12 1.023,13 286.33,14 14,15 21,16 23,17 2,18 4.854}
{0 CHEMBL421959,1 13,2 27.603,3 26.289,4 40.912,5 46.481,6 44,7 41,9 17,10 34.5,11 7.473,12 0.998,13 306.41,14 18,15 23,16 26,17 4,18 4.796}
{0 CHEMBL422316,1 16,2 39.165,3 38.465,4 61.302,5 68.272,6 63,7 60,8 3,9 23,10 49.5,11 7.992,12 1.022,13 479.55,14 25,15 35,16 38,17 7,18 5.745}
{0 CHEMBL423200,1 18,2 29.086,3 28.257,4 41.247,5 46.149,6 45,7 41,9 19,10 43,11 8.327,12 1.006,13 341.41,14 15,15 26,16 30,17 1,18 7}
{0 CHEMBL423381,1 18,2 29.54,3 28.972,4 42.574,5 47.358,6 46,7 42,9 19,10 42.5,11 8.51,12 1.014,13 357.41,14 15,15 27,16 31,17 1,18 5.469}
{0 CHEMBL423558,1 10,2 32.006,3 30.519,4 51.327,5 58.272,6 53,7 51,9 18,10 34,11 7.049,12 1.006,13 359.48,14 25,15 26,16 28,17 8,18 4.21}
{0 CHEMBL423560,1 13,2 32.034,3 30.772,4 49.334,5 55.73,6 52,7 49,9 19,10 38.5,11 7.479,12 1.007,13 366.47,14 22,15 27,16 30,17 6,18 6.387}
{0 CHEMBL423939,1 15,2 32.182,3 31.675,4 50.105,5 55.734,6 52,7 49,9 19,10 42.5,11 8.091,12 1.023,13 396.45,14 20,15 29,16 32,17 4,18 5.509}
{0 CHEMBL424113,1 18,2 29.847,3 28.784,4 43.131,5 48.564,6 46,7 43,9 19,10 40.5,11 7.987,12 1.003,13 343.43,14 17,15 26,16 29,17 1,18 5.31}
{0 CHEMBL425893,1 14,2 35.245,3 33.993,4 53.443,5 59.857,6 55,7 53,8 1,9 22,10 43.5,11 7.651,12 1.008,13 405.5,14 23,15 30,16 32,17 6,18 8.854}
{0 CHEMBL427826,1 8,2 21.409,3 21.418,4 35.349,5 40.002,6 35,7 34,8 2,9 12,10 26,11 8.391,12 1.04,13 285.31,14 14,15 20,16 21,17 4,18 6.88}
{0 CHEMBL430821,1 21,2 39.495,3 38.509,4 58.763,5 65.438,6 62,7 58,8 2,9 25,10 52.5,11 8.096,12 1.013,13 469.55,14 23,15 35,16 39,17 4,18 8.959}
{0 CHEMBL431257,1 11,2 25.205,3 24.907,4 40.011,5 44.694,6 41,7 39,9 14,10 33,11 8.112,12 1.026,13 316.36,14 16,15 23,16 25,17 3,18 4.226}
{0 CHEMBL431740,1 16,2 33.136,3 32.803,4 48.869,5 53.207,6 50,7 47,8 5,9 19,10 45,11 9.858,12 1.04,13 463.31,14 16,15 31,16 34,17 3,18 6}
{0 CHEMBL433021,1 12,2 30.267,3 28.437,4 43.654,5 48.578,6 45,7 43,9 16,10 35,11 9.869,12 1.015,13 424.36,14 18,15 25,16 27,17 4,18 5}
{0 CHEMBL434097,1 14,2 30.029,3 28.751,4 46.232,5 52.232,6 48,7 46,9 18,10 35.5,11 7.379,12 1.005,13 339.44,14 21,15 25,16 27,17 4,18 4.398}
{0 CHEMBL435479,1 17,2 35.04,3 33.794,4 53.436,5 60.229,6 56,7 53,9 21,10 44,11 7.651,12 1.008,13 405.51,14 23,15 30,16 33,17 4,18 6.456}
{0 CHEMBL435938,1 14,2 40.745,3 38.815,4 64.305,5 72.727,6 66,7 64,8 1,9 24,10 44.5,11 7.087,12 1.005,13 453.6,14 31,15 33,16 35,17 10,18 7.456}
{0 CHEMBL439816,1 13,2 29.318,3 27.944,4 41.56,5 46.369,6 44,7 41,9 17,10 36.5,11 9.153,12 1.014,13 375.29,14 16,15 25,16 28,17 4,18 5.301}
{0 CHEMBL439973,1 15,2 35.154,3 34.422,4 55.098,5 61.275,6 56,7 54,8 3,9 21,10 44,11 7.879,12 1.02,13 425.49,14 23,15 31,16 33,17 6,18 5.921}
{0 CHEMBL440479,1 10,2 30.898,3 29.621,4 48.76,5 55.173,6 49,7 48,8 1,9 16,10 34,11 7.915,12 1.016,13 379.9,14 22,15 26,16 27,17 6,18 6.357}
{0 CHEMBL441298,1 14,2 31.239,3 29.971,4 48.342,5 54.358,6 50,7 48,9 19,10 36.5,11 7.384,12 1.007,13 354.45,14 22,15 26,16 28,17 5,18 4.854}
{0 CHEMBL441503,1 14,2 31.79,3 30.278,4 49.116,5 55.647,6 51,7 49,8 2,9 19,10 36,11 7.214,12 1.002,13 353.47,14 23,15 26,16 28,17 5,18 7.6}
{0 CHEMBL441668,1 10,2 29.239,3 27.971,4 46.342,5 52.358,6 48,7 46,9 17,10 32,11 7.183,12 1.007,13 330.43,14 22,15 24,16 26,17 7,18 4.495}
{0 CHEMBL443,1 9,2 19.074,3 18.503,4 28.898,5 31.704,6 29,7 28,8 2,9 10,10 25.5,11 9.047,12 1.032,13 253.31,14 11,15 17,16 18,17 1,18 7}
{0 CHEMBL445359,1 13,2 26.557,3 25.417,4 37.676,5 41.954,6 39,7 37,9 15,10 33.5,11 9.439,12 1.018,13 349.25,14 14,15 23,16 25,17 2,18 6.77}
{0 CHEMBL455012,1 18,2 35.643,3 33.375,4 52.345,5 59.644,6 56,7 53,9 23,10 42,11 7.01,12 0.988,13 371.53,14 25,15 28,16 31,17 5,18 7.377}
{0 CHEMBL48203,1 10,2 29.682,3 28.38,4 45.549,5 51.548,6 47,7 45,8 1,9 16,10 34,11 8.042,12 1.012,13 361.88,14 20,15 25,16 27,17 6,18 5.77}
{0 CHEMBL49246,1 10,2 26.466,3 25.138,4 40.338,5 45.923,6 41,7 40,8 1,9 14,10 30,11 7.996,12 1.008,13 319.84,14 18,15 22,16 23,17 4,18 5.553}
{0 CHEMBL492895,1 14,2 33.552,3 31.805,4 52,5 59.062,6 54,7 52,9 20,10 37.5,11 7.067,12 1,13 367.5,14 25,15 27,16 29,17 6,18 7.42}
{0 CHEMBL492896,1 18,2 33.881,3 31.848,4 49.461,5 56.228,6 53,7 50,9 22,10 41,11 7.15,12 0.989,13 357.5,14 23,15 27,16 30,17 4,18 7.569}
{0 CHEMBL493717,1 14,2 27.358,3 25.795,4 40.694,5 46.398,6 43,7 41,9 17,10 32.5,11 7.156,12 0.993,13 293.41,14 19,15 22,16 24,17 3,18 7.678}
{0 CHEMBL493718,1 18,2 32.12,3 30.321,4 46.578,5 52.813,6 50,7 47,9 21,10 40,11 7.308,12 0.991,13 343.47,14 21,15 26,16 29,17 3,18 8.602}
{0 CHEMBL49454,1 13,2 35.25,3 34.014,4 54.545,5 61.355,6 56,7 54,9 21,10 42.5,11 7.565,12 1.01,13 408.51,14 24,15 30,16 32,17 6,18 7.272}
{0 CHEMBL50514,1 13,2 33.25,3 32.014,4 52.545,5 59.355,6 54,7 52,9 19,10 38.5,11 7.394,12 1.01,13 384.49,14 24,15 28,16 30,17 6,18 7.879}
{0 CHEMBL51706,1 13,2 25.654,3 24.718,4 35.116,5 38.483,6 36,7 34,9 14,10 33.5,11 10.872,12 1.033,13 369.66,14 11,15 23,16 25,17 1,18 5.699}
{0 CHEMBL521672,1 14,2 31.79,3 30.278,4 49.116,5 55.647,6 51,7 49,9 19,10 36.5,11 7.214,12 1.002,13 353.47,14 23,15 26,16 28,17 5,18 8.004}
{0 CHEMBL522543,1 14,2 29.932,3 28.277,4 41.665,5 46.23,6 43,7 41,9 17,10 35.5,11 9.676,12 1.016,13 396.73,14 16,15 25,16 27,17 3,18 8.161}
{0 CHEMBL522678,1 18,2 32.12,3 30.321,4 46.578,5 52.813,6 50,7 47,9 21,10 40,11 7.308,12 0.991,13 343.47,14 21,15 26,16 29,17 3,18 8.143}
{0 CHEMBL523004,1 14,2 35.313,3 33.331,4 54.883,5 62.478,6 57,7 55,9 21,10 38.5,11 6.937,12 0.998,13 381.53,14 27,15 28,16 30,17 7,18 7.602}
{0 CHEMBL52415,1 17,2 33.932,3 33.159,4 50.785,5 56.152,6 52,7 50,8 1,9 22,10 44,11 8.089,12 1.016,13 404.46,14 20,15 30,16 32,17 3,18 5.921}
{0 CHEMBL52433,1 13,2 35.012,3 33.541,4 55.429,5 62.77,6 57,7 55,9 20,10 39.5,11 7.246,12 1.008,13 398.52,14 26,15 29,16 31,17 7,18 6.304}
{0 CHEMBL52688,1 13,2 31.489,3 30.487,4 49.662,5 55.94,6 51,7 49,9 18,10 37.5,11 7.56,12 1.014,13 370.46,14 22,15 27,16 29,17 5,18 6.921}
{0 CHEMBL52698,1 13,2 27.415,3 26.245,4 38,5 41.898,6 39,7 37,9 15,10 34.5,11 10.37,12 1.027,13 383.69,14 13,15 24,16 26,17 2,18 6.602}
{0 CHEMBL52777,1 13,2 25.296,3 24.477,4 38.356,5 43.275,6 40,7 38,9 15,10 32.5,11 7.799,12 1.009,13 296.37,14 16,15 22,16 24,17 2,18 6.071}
{0 CHEMBL52836,1 13,2 25.296,3 24.477,4 38.356,5 43.275,6 40,7 38,9 15,10 32.5,11 7.799,12 1.009,13 296.37,14 16,15 22,16 24,17 2,18 5.77}
{0 CHEMBL52947,1 13,2 27.512,3 26.719,4 42.567,5 47.9,6 44,7 42,9 16,10 34.5,11 7.771,12 1.014,13 326.4,14 18,15 24,16 26,17 3,18 5.357}
{0 CHEMBL53165,1 13,2 23.938,3 23.063,4 34.469,5 38.595,6 36,7 34,9 14,10 31.5,11 8.846,12 1.014,13 300.78,14 13,15 21,16 23,17 1,18 6.276}
{0 CHEMBL53193,1 10,2 26.478,3 25.444,4 42.458,5 47.943,6 43,7 42,9 15,10 29,11 7.247,12 1.011,13 304.39,14 20,15 22,16 23,17 5,18 4.886}
{0 CHEMBL53318,1 13,2 25.699,3 24.59,4 37.353,5 42.01,6 39,7 37,9 15,10 32.5,11 8.508,12 1.01,13 314.81,14 15,15 22,16 24,17 2,18 6.678}
{0 CHEMBL53420,1 13,2 25.654,3 24.718,4 35.116,5 38.483,6 36,7 34,9 14,10 33.5,11 10.872,12 1.033,13 369.66,14 11,15 23,16 25,17 1,18 6.181}
{0 CHEMBL53693,1 13,2 36.773,3 35.068,4 58.312,5 66.185,6 60,7 58,9 21,10 40.5,11 7.113,12 1.005,13 412.55,14 28,15 30,16 32,17 8,18 7.873}
{0 CHEMBL53902,1 10,2 24.705,3 23.611,4 37.454,5 42.508,6 38,7 37,8 1,9 13,10 29,11 8.265,12 1.012,13 305.81,14 16,15 21,16 22,17 3,18 5.337}
{0 CHEMBL53903,1 17,2 31.819,3 30.531,4 47.123,5 53.106,6 50,7 47,9 20,10 41,11 7.669,12 1.003,13 360.46,14 20,15 27,16 30,17 3,18 7.387}
{0 CHEMBL53974,1 13,2 27.057,3 26.004,4 41.24,5 46.69,6 43,7 41,9 16,10 33.5,11 7.571,12 1.006,13 310.4,14 18,15 23,16 25,17 3,18 6.292}
{0 CHEMBL54007,1 10,2 33.966,3 31.96,4 53.2,5 60.794,6 54,7 53,8 1,9 18,10 35,11 7.395,12 1.004,13 391.96,14 26,15 27,16 28,17 8,18 5.31}
{0 CHEMBL54399,1 13,2 25.699,3 24.59,4 37.353,5 42.01,6 39,7 37,9 15,10 32.5,11 8.508,12 1.01,13 314.81,14 15,15 22,16 24,17 2,18 5.678}
{0 CHEMBL54523,1 13,2 25.296,3 24.477,4 38.356,5 43.275,6 40,7 38,9 15,10 32.5,11 7.799,12 1.009,13 296.37,14 16,15 22,16 24,17 2,18 5.569}
{0 CHEMBL54538,1 17,2 29.603,3 28.289,4 42.912,5 48.481,6 46,7 43,9 19,10 39,11 7.684,12 0.998,13 330.43,14 18,15 25,16 28,17 2,18 7.398}
{0 CHEMBL54618,1 13,2 23.938,3 23.063,4 34.469,5 38.595,6 36,7 34,9 14,10 31.5,11 8.846,12 1.014,13 300.78,14 13,15 21,16 23,17 1,18 5.699}
{0 CHEMBL54659,1 10,2 31.898,3 30.621,4 49.76,5 56.173,6 51,7 49,8 1,9 17,10 36,11 7.998,12 1.016,13 391.91,14 22,15 27,16 29,17 7,18 6.244}
{0 CHEMBL54732,1 13,2 26.557,3 25.417,4 37.676,5 41.954,6 39,7 37,9 15,10 33.5,11 9.439,12 1.018,13 349.25,14 14,15 23,16 25,17 2,18 6.301}
{0 CHEMBL54733,1 13,2 23.08,3 22.236,4 34.145,5 38.651,6 36,7 34,9 14,10 30.5,11 7.834,12 1.004,13 266.34,14 14,15 20,16 22,17 1,18 5.77}
{0 CHEMBL54792,1 13,2 27.057,3 26.004,4 41.24,5 46.69,6 43,7 41,9 16,10 33.5,11 7.571,12 1.006,13 310.4,14 18,15 23,16 25,17 3,18 7.013}
{0 CHEMBL54913,1 13,2 24.796,3 23.891,4 34.793,5 38.539,6 36,7 34,9 14,10 32.5,11 9.859,12 1.023,13 335.22,14 12,15 22,16 24,17 1,18 6}
{0 CHEMBL55063,1 13,2 24.841,3 23.762,4 37.029,5 42.066,6 39,7 37,9 15,10 31.5,11 7.578,12 1.001,13 280.37,14 16,15 21,16 23,17 2,18 6.538}
{0 CHEMBL55179,1 13,2 29.728,3 28.96,4 46.778,5 52.524,6 48,7 46,9 17,10 36.5,11 7.748,12 1.017,13 356.43,14 20,15 26,16 28,17 4,18 5.699}
{0 CHEMBL55191,1 13,2 26.557,3 25.417,4 37.676,5 41.954,6 39,7 37,9 15,10 33.5,11 9.439,12 1.018,13 349.25,14 14,15 23,16 25,17 2,18 6.824}
{0 CHEMBL55526,1 11,2 27.222,3 25.644,4 41.12,5 46.84,6 42,7 41,8 1,9 15,10 30,11 7.777,12 1.003,13 318.85,14 19,15 22,16 23,17 4,18 4.975}
{0 CHEMBL55584,1 10,2 32.205,3 30.433,4 50.316,5 57.378,6 51,7 50,8 1,9 17,10 34,11 7.559,12 1.006,13 377.93,14 24,15 26,16 27,17 7,18 5.602}
{0 CHEMBL55656,1 17,2 28.483,3 26.928,4 39.003,5 43.488,6 42,7 39,9 18,10 38,11 8.55,12 1,13 333.45,14 15,15 24,16 27,17 1,18 6.328}
{0 CHEMBL55697,1 10,2 37.035,3 34.299,4 57.64,5 66.415,6 59,7 58,8 1,9 20,10 36,11 6.966,12 0.994,13 404.02,14 30,15 28,16 29,17 10,18 4.959}
{0 CHEMBL55727,1 17,2 29.603,3 28.289,4 42.912,5 48.481,6 46,7 43,9 19,10 39,11 7.684,12 0.998,13 330.43,14 18,15 25,16 28,17 2,18 7.284}
{0 CHEMBL55764,1 17,2 39.421,3 37.675,4 59.527,5 67.003,6 61,7 59,8 2,9 23,10 46,11 7.932,12 1.009,13 468.01,14 26,15 33,16 35,17 6,18 6.77}
{0 CHEMBL55903,1 16,2 34.989,3 33.192,4 51.105,5 57.754,6 54,7 51,8 1,9 21,10 42,11 7.999,12 1.002,13 407.95,14 22,15 29,16 32,17 5,18 5.301}
{0 CHEMBL55928,1 13,2 27.512,3 26.719,4 42.567,5 47.9,6 44,7 42,9 16,10 34.5,11 7.771,12 1.014,13 326.4,14 18,15 24,16 26,17 3,18 6.046}
{0 CHEMBL56169,1 10,2 28.228,3 26.665,4 43.222,5 49.339,6 44,7 43,8 1,9 15,10 31,11 7.764,12 1.005,13 333.87,14 20,15 23,16 24,17 5,18 4.851}
{0 CHEMBL56170,1 16,2 33.034,3 31.772,4 50.334,5 56.73,6 52,7 50,8 2,9 20,10 41,11 7.57,12 1.007,13 378.48,14 22,15 28,16 30,17 4,18 5.796}
{0 CHEMBL56311,1 10,2 26.466,3 25.138,4 40.338,5 45.923,6 41,7 40,8 1,9 14,10 30,11 7.996,12 1.008,13 319.84,14 18,15 22,16 23,17 4,18 5.222}
{0 CHEMBL56366,1 10,2 29.228,3 27.665,4 44.222,5 50.339,6 46,7 44,8 1,9 16,10 33,11 7.861,12 1.005,13 345.88,14 20,15 24,16 26,17 6,18 4.959}
{0 CHEMBL56456,1 10,2 30.444,3 28.907,4 47.432,5 53.963,6 48,7 47,8 1,9 16,10 33,11 7.743,12 1.009,13 363.9,14 22,15 25,16 26,17 6,18 4.939}
{0 CHEMBL56532,1 10,2 31.444,3 29.907,4 48.432,5 54.963,6 50,7 48,8 1,9 17,10 35,11 7.831,12 1.009,13 375.91,14 22,15 26,16 28,17 7,18 5.481}
{0 CHEMBL56709,1 10,2 28.682,3 27.38,4 44.549,5 50.548,6 45,7 44,8 1,9 15,10 32,11 7.952,12 1.012,13 349.87,14 20,15 24,16 25,17 5,18 5.456}
{0 CHEMBL56861,1 10,2 36.279,3 33.794,4 56.858,5 65.498,6 58,7 57,8 1,9 19,10 36,11 7.105,12 0.998,13 405.01,14 29,15 28,16 29,17 9,18 4.74}
{0 CHEMBL56862,1 16,2 33.989,3 32.192,4 50.105,5 56.754,6 52,7 50,8 1,9 20,10 40,11 7.919,12 1.002,13 395.94,14 22,15 28,16 30,17 4,18 5.553}
{0 CHEMBL57222,1 10,2 21.557,3 20.8,4 31.527,5 35.387,6 32,7 31,9 12,10 28,11 8.895,12 1.017,13 275.75,14 12,15 19,16 20,17 2,18 6.721}
{0 CHEMBL57610,1 10,2 28.228,3 26.665,4 43.222,5 49.339,6 44,7 43,8 1,9 15,10 31,11 7.764,12 1.005,13 333.87,14 20,15 23,16 24,17 5,18 5.18}
{0 CHEMBL57624,1 13,2 29.273,3 28.246,4 45.451,5 51.315,6 47,7 45,9 17,10 35.5,11 7.565,12 1.01,13 340.43,14 20,15 25,16 27,17 4,18 7.041}
{0 CHEMBL57637,1 13,2 32.489,3 31.487,4 50.662,5 56.94,6 53,7 50,9 19,10 39.5,11 7.649,12 1.013,13 382.47,14 22,15 28,16 31,17 6,18 5.644}
{0 CHEMBL57682,1 16,2 31.421,3 31.148,4 48.222,5 53.319,6 50,7 47,8 5,9 19,10 43,11 8.392,12 1.026,13 394.43,14 18,15 29,16 32,17 3,18 5.495}
{0 CHEMBL58597,1 15,2 31.728,3 30.96,4 48.778,5 54.524,6 51,7 48,8 1,9 19,10 40.5,11 7.926,12 1.016,13 380.45,14 20,15 28,16 31,17 4,18 5.337}
{0 CHEMBL59530,1 10,2 21.841,3 21.471,4 33.022,5 36.515,6 33,7 32,8 2,9 12,10 29,11 9.179,12 1.032,13 293.74,14 12,15 20,16 21,17 2,18 6.071}
{0 CHEMBL596672,1 15,2 33.733,3 33.271,4 51.734,5 56.574,6 52,7 50,8 3,9 19,10 44,11 8.91,12 1.035,13 445.5,14 19,15 31,16 33,17 4,18 7.108}
{0 CHEMBL596673,1 16,2 26.932,3 25.622,4 37.229,5 41.199,6 40,7 37,9 17,10 36.5,11 8.714,12 1.006,13 322.42,14 14,15 23,16 26,17 1,18 4.921}
{0 CHEMBL596680,1 12,2 23.886,3 22.75,4 31.993,5 34.671,6 33,7 31,9 13,10 31,11 11.008,12 1.032,13 341.24,14 10,15 21,16 23,17 1,18 4.222}
{0 CHEMBL596681,1 12,2 26.602,3 25.578,4 39.767,5 44.033,6 41,7 39,9 15,10 33,11 8.524,12 1.02,13 332.42,14 16,15 23,16 25,17 3,18 4.62}
{0 CHEMBL597885,1 12,2 24.387,3 23.336,4 35.556,5 39.408,6 37,7 35,9 14,10 31,11 8.64,12 1.016,13 302.39,14 14,15 21,16 23,17 2,18 4.46}
{0 CHEMBL598090,1 12,2 24.387,3 23.336,4 35.556,5 39.408,6 37,7 35,9 14,10 31,11 8.64,12 1.016,13 302.39,14 14,15 21,16 23,17 2,18 4.693}
{0 CHEMBL598292,1 12,2 24.387,3 23.336,4 35.556,5 39.408,6 37,7 35,9 14,10 31,11 8.64,12 1.016,13 302.39,14 14,15 21,16 23,17 2,18 4.599}
{0 CHEMBL598293,1 12,2 26.602,3 25.578,4 39.767,5 44.033,6 41,7 39,9 15,10 33,11 8.524,12 1.02,13 332.42,14 16,15 23,16 25,17 3,18 4.439}
{0 CHEMBL602104,1 16,2 26.932,3 25.622,4 37.229,5 41.199,6 40,7 37,9 17,10 36.5,11 8.714,12 1.006,13 322.42,14 14,15 23,16 26,17 1,18 5.066}
{0 CHEMBL604722,1 12,2 23.495,3 25.305,4 37.818,5 40.577,6 36,7 34,9 14,10 37,11 12.127,12 1.112,13 412.32,14 7,15 27,16 29,17 2,18 4.509}
{0 CHEMBL608610,1 4,2 23.114,3 23.087,4 39.309,5 42.511,6 38,7 37,8 4,9 10,10 27,11 9.142,12 1.062,13 338.24,14 15,15 22,16 23,17 6,18 4.824}
{0 CHEMBL60968,1 13,2 32.943,3 32.202,4 51.989,5 58.149,6 54,7 51,9 19,10 40.5,11 7.813,12 1.019,13 398.47,14 22,15 29,16 32,17 6,18 5.301}
{0 CHEMBL609896,1 12,2 25.693,3 24.148,4 37.113,5 41.614,6 39,7 37,9 15,10 31,11 8.119,12 1.003,13 300.42,14 16,15 21,16 23,17 3,18 4.699}
{0 CHEMBL61108,1 12,2 23.244,3 22.584,4 33.018,5 36.25,6 34,7 32,9 13,10 31,11 10.131,12 1.032,13 324.19,14 11,15 21,16 23,17 1,18 4.179}
{0 CHEMBL61110,1 12,2 22.387,3 21.757,4 32.694,5 36.306,6 34,7 32,9 13,10 30,11 9.055,12 1.022,13 289.75,14 12,15 20,16 22,17 1,18 4.585}
{0 CHEMBL611984,1 12,2 29.216,3 27.202,4 42.88,5 48.444,6 45,7 43,9 17,10 33,11 7.639,12 0.997,13 328.48,14 20,15 23,16 25,17 5,18 4.438}
{0 CHEMBL61415,1 12,2 27.722,3 26.939,4 43.676,5 49.026,6 45,7 43,9 16,10 34,11 7.66,12 1.016,13 329.4,14 19,15 24,16 26,17 4,18 4.06}
{0 CHEMBL61927,1 12,2 27.722,3 26.939,4 43.676,5 49.026,6 45,7 43,9 16,10 34,11 7.66,12 1.016,13 329.4,14 19,15 24,16 26,17 4,18 4.252}
{0 CHEMBL64729,1 12,2 28.176,3 27.654,4 45.003,5 50.236,6 46,7 44,9 16,10 35,11 7.85,12 1.023,13 345.4,14 19,15 25,16 27,17 4,18 4.658}
{0 CHEMBL64785,1 12,2 25.96,3 25.412,4 40.793,5 45.611,6 42,7 40,9 15,10 33,11 7.884,12 1.02,13 315.37,14 17,15 23,16 25,17 3,18 4.699}
{0 CHEMBL6666,1 15,2 36.415,3 34.653,4 55.425,5 62.505,6 57,7 55,8 3,9 21,10 41,11 7.799,12 1.008,13 428.97,14 25,15 30,16 32,17 6,18 8.73}
{0 CHEMBL6671,1 14,2 36.887,3 36.008,4 59.305,5 66.912,6 60,7 58,8 2,9 22,10 42,11 7.751,12 1.022,13 449.53,14 26,15 32,16 34,17 8,18 8.24}
{0 CHEMBL6696,1 4,2 18.591,3 17.246,4 29.709,5 34.484,6 31,7 30,9 10,10 18,11 6.41,12 0.99,13 192.3,14 16,15 14,16 15,17 6,18 5.161}
{0 CHEMBL6771,1 14,2 35.313,3 33.331,4 54.883,5 62.478,6 57,7 55,8 2,9 21,10 38,11 6.937,12 0.998,13 381.53,14 27,15 28,16 30,17 7,18 7.42}
{0 CHEMBL6899,1 10,2 30.245,3 28.993,4 48.443,5 54.857,6 50,7 48,9 17,10 33,11 7.197,12 1.009,13 345.45,14 23,15 25,16 27,17 7,18 5.161}
{0 CHEMBL69363,1 12,2 30.034,3 28.772,4 47.334,5 53.73,6 49,7 47,9 17,10 35,11 7.286,12 1.007,13 342.45,14 22,15 25,16 27,17 5,18 4.678}
{0 CHEMBL69681,1 12,2 28.728,3 27.96,4 45.778,5 51.524,6 47,7 45,9 16,10 35,11 7.654,12 1.017,13 344.42,14 20,15 25,16 27,17 4,18 4.638}
{0 CHEMBL6970,1 10,2 24.353,3 22.773,4 36.592,5 41.9,6 39,7 37,9 15,10 27,11 6.875,12 0.989,13 254.37,14 18,15 19,16 21,17 5,18 6.538}
{0 CHEMBL6971,1 10,2 26.068,3 24.428,4 37.24,5 41.788,6 39,7 37,9 15,10 29,11 8.736,12 1.006,13 323.25,14 16,15 21,16 23,17 5,18 4.824}
{0 CHEMBL7004,1 8,2 21.597,3 20.268,4 33.811,5 38.983,6 35,7 34,8 2,9 12,10 23,11 6.804,12 0.994,13 231.34,14 17,15 17,16 18,17 4,18 6.78}
{0 CHEMBL7062,1 10,2 26.381,3 26.165,4 42.341,5 47.543,6 43,7 41,9 16,10 32,11 8.253,12 1.033,13 338.37,14 17,15 24,16 26,17 6,18 6.237}
{0 CHEMBL7063,1 10,2 31,3 29.498,4 49.225,5 55.773,6 51,7 49,9 18,10 33,11 7.03,12 1.005,13 344.46,14 24,15 25,16 27,17 8,18 7.041}
{0 CHEMBL7139,1 10,2 28.029,3 26.751,4 44.232,5 50.232,6 46,7 44,9 16,10 31,11 7.169,12 1.005,13 315.42,14 21,15 23,16 25,17 6,18 5.481}
{0 CHEMBL7170,1 4,2 23.569,3 22.015,4 37.803,5 43.524,6 40,7 38,9 13,10 23,11 6.536,12 0.995,13 248.37,14 20,15 18,16 20,17 9,18 6.056}
{0 CHEMBL7263,1 10,2 29.79,3 28.278,4 47.116,5 53.647,6 49,7 47,9 17,10 32,11 7.01,12 1.002,13 329.45,14 23,15 24,16 26,17 7,18 5.777}
{0 CHEMBL7357,1 14,2 29.574,3 28.036,4 44.905,5 51.023,6 47,7 45,8 2,9 18,10 34,11 7.188,12 0.998,13 323.44,14 21,15 24,16 26,17 4,18 7.19}
{0 CHEMBL7375,1 10,2 28.784,3 27.256,4 45.014,5 51.149,6 47,7 45,9 17,10 31,11 6.987,12 1,13 314.43,14 22,15 23,16 25,17 7,18 7.244}
{0 CHEMBL7452,1 10,2 26.569,3 25.015,4 40.803,5 46.524,6 43,7 41,9 16,10 29,11 6.937,12 0.995,13 284.4,14 20,15 21,16 23,17 6,18 6.357}
{0 CHEMBL747,1 8,2 20.693,3 19.569,4 31.251,5 35.512,6 32,7 31,8 2,9 11,10 23,11 8.121,12 1.008,13 251.75,14 14,15 17,16 18,17 3,18 6.654}
{0 CHEMBL7488,1 10,2 32.006,3 30.519,4 51.327,5 58.272,6 53,7 51,9 18,10 34,11 7.049,12 1.006,13 359.48,14 25,15 26,16 28,17 8,18 5.337}
{0 CHEMBL7492,1 13,2 28.267,3 27.224,4 43.349,5 48.817,6 45,7 43,9 17,10 34.5,11 7.568,12 1.008,13 325.41,14 19,15 24,16 26,17 4,18 7.489}
{0 CHEMBL7535,1 10,2 22.591,3 21.246,4 33.709,5 38.484,6 36,7 34,9 14,10 26,11 7.069,12 0.991,13 240.34,14 16,15 18,16 20,17 4,18 5.658}
{0 CHEMBL7542,1 10,2 26.114,3 24.3,4 39.476,5 45.315,6 42,7 40,9 16,10 28,11 6.71,12 0.987,13 268.4,14 20,15 20,16 22,17 6,18 6.602}
{0 CHEMBL7571,1 4,2 22.114,3 20.3,4 35.476,5 41.315,6 37,7 36,9 12,10 20,11 6.121,12 0.985,13 220.36,14 20,15 16,16 17,17 8,18 6.745}
{0 CHEMBL7586,1 8,2 23.239,3 21.434,4 33.785,5 38.404,6 36,7 34,9 13,10 25.5,11 7.659,12 0.994,13 260.4,14 16,15 18,16 20,17 5,18 5.77}
{0 CHEMBL77409,1 16,2 26.648,3 26.579,4 40.134,5 43.907,6 41,7 39,8 2,9 17,10 37.5,11 8.676,12 1.029,13 338.35,14 14,15 25,16 27,17 1,18 6}
{0 CHEMBL7779,1 10,2 26.114,3 24.3,4 39.476,5 45.315,6 42,7 40,9 16,10 28,11 6.71,12 0.987,13 268.4,14 20,15 20,16 22,17 6,18 6.469}
{0 CHEMBL78022,1 15,2 31.387,3 30.874,4 49.113,5 54.362,6 50,7 48,8 1,9 19,10 39.5,11 8.009,12 1.023,13 384.43,14 20,15 28,16 30,17 4,18 6.252}
{0 CHEMBL78578,1 14,2 25.597,3 24.268,4 37.811,5 42.983,6 40,7 38,9 16,10 31.5,11 7.352,12 0.995,13 279.38,14 17,15 21,16 23,17 2,18 7.018}
{0 CHEMBL78631,1 15,2 26.5,3 25.676,4 39.363,5 43.903,6 41,7 39,8 1,9 17,10 34.5,11 7.907,12 1.009,13 308.37,14 16,15 23,16 25,17 2,18 4.951}
{0 CHEMBL79123,1 13,2 24.841,3 23.762,4 37.029,5 42.066,6 39,7 37,9 15,10 31.5,11 7.578,12 1.001,13 280.37,14 16,15 21,16 23,17 2,18 7.097}
{0 CHEMBL79182,1 14,2 25.745,3 25.171,4 38.582,5 42.986,6 40,7 38,8 1,9 16,10 34.5,11 8.141,12 1.015,13 309.36,14 15,15 23,16 25,17 2,18 6.602}
{0 CHEMBL79216,1 15,2 29.171,3 28.632,4 44.902,5 49.737,6 46,7 44,8 1,9 18,10 37.5,11 8.055,12 1.02,13 354.4,14 18,15 26,16 28,17 3,18 5.62}
{0 CHEMBL79347,1 13,2 27.955,3 26.314,4 40.142,5 45.323,6 42,7 40,9 16,10 33.5,11 9.332,12 1.004,13 373.29,14 17,15 23,16 25,17 3,18 7.432}
{0 CHEMBL79464,1 27,2 43.495,3 42.509,4 62.763,5 69.438,6 67,7 62,8 2,9 29,10 60.5,11 8.348,12 1.012,13 517.59,14 23,15 39,16 44,17 2,18 9}
{0 CHEMBL79922,1 13,2 28.819,3 27.531,4 44.123,5 50.106,6 46,7 44,9 17,10 34.5,11 7.373,12 1.003,13 324.43,14 20,15 24,16 26,17 4,18 7.523}
{0 CHEMBL80065,1 13,2 26.194,3 24.788,4 37.258,5 41.907,6 39,7 37,9 15,10 32.5,11 9.71,12 1.007,13 359.26,14 15,15 22,16 24,17 2,18 7.093}
{0 CHEMBL80066,1 13,2 25.699,3 24.59,4 37.353,5 42.01,6 39,7 37,9 15,10 32.5,11 8.508,12 1.01,13 314.81,14 15,15 22,16 24,17 2,18 7.638}
{0 CHEMBL80070,1 13,2 27.057,3 26.004,4 41.24,5 46.69,6 43,7 41,9 16,10 33.5,11 7.571,12 1.006,13 310.4,14 18,15 23,16 25,17 3,18 7.162}
{0 CHEMBL80123,1 17,2 25.739,3 25.149,4 37.48,5 41.488,6 39,7 37,8 2,9 17,10 35.5,11 8.28,12 1.013,13 306.35,14 14,15 23,16 25,18 5.678}
{0 CHEMBL80746,1 14,2 23.836,3 22.741,4 34.927,5 39.568,6 37,7 35,9 15,10 30.5,11 7.581,12 0.998,13 265.35,14 15,15 20,16 22,17 1,18 6.009}
{0 CHEMBL80935,1 14,2 23.983,3 23.644,4 35.698,5 39.571,6 37,7 35,8 1,9 15,10 33.5,11 8.438,12 1.02,13 295.33,14 13,15 22,16 24,17 1,18 5.264}
{0 CHEMBL81119,1 13,2 25.699,3 24.59,4 37.353,5 42.01,6 39,7 37,9 15,10 32.5,11 8.508,12 1.01,13 314.81,14 15,15 22,16 24,17 2,18 7.328}
{0 CHEMBL81294,1 16,2 31.273,3 30.246,4 47.451,5 53.315,6 49,7 47,8 2,9 19,10 40,11 7.754,12 1.01,13 364.45,14 20,15 27,16 29,17 3,18 5.987}
{0 CHEMBL81820,1 13,2 26.557,3 25.417,4 37.676,5 41.954,6 39,7 37,9 15,10 33.5,11 9.439,12 1.018,13 349.25,14 14,15 23,16 25,17 2,18 6.495}
{0 CHEMBL81995,1 20,2 32.301,3 31.499,4 46.458,5 51.774,6 50,7 46,8 1,9 21,10 45.5,11 8.336,12 1.01,13 383.45,14 17,15 29,16 33,17 1,18 7.509}
{0 CHEMBL82924,1 13,2 29.176,3 27.772,4 40.884,5 45.313,6 42,7 40,9 16,10 35.5,11 9.943,12 1.022,13 397.72,14 15,15 25,16 27,17 3,18 6.981}
{0 CHEMBL82936,1 21,2 41.256,3 40.035,4 61.647,5 68.853,6 65,7 61,8 2,9 26,10 53.5,11 7.928,12 1.011,13 483.58,14 25,15 36,16 40,17 5,18 7.959}
{0 CHEMBL82975,1 13,2 28.318,3 26.944,4 40.56,5 45.369,6 42,7 40,9 16,10 34.5,11 9.082,12 1.014,13 363.28,14 16,15 24,16 26,17 3,18 7}
{0 CHEMBL84273,1 21,2 37.733,3 36.982,4 55.88,5 62.023,6 59,7 55,8 2,9 24,10 51.5,11 8.282,12 1.016,13 455.52,14 21,15 34,16 38,17 3,18 7.62}
{0 CHEMBL84457,1 13,2 27.057,3 26.004,4 41.24,5 46.69,6 43,7 41,9 16,10 33.5,11 7.571,12 1.006,13 310.4,14 18,15 23,16 25,17 3,18 7.162}
{0 CHEMBL88430,1 14,2 29.125,3 28.052,4 43.673,5 48.761,6 45,7 43,9 17,10 35.5,11 8.369,12 1.016,13 359.85,14 18,15 25,16 27,17 3,18 7.292}
{0 CHEMBL88555,1 14,2 31.341,3 30.293,4 47.883,5 53.385,6 49,7 47,9 18,10 37.5,11 8.295,12 1.019,13 389.88,14 20,15 27,16 29,17 4,18 7.481}
{0 CHEMBL89528,1 13,2 25.699,3 24.59,4 37.353,5 42.01,6 39,7 37,9 15,10 32.5,11 8.508,12 1.01,13 314.81,14 15,15 22,16 24,17 2,18 7.208}
