{
  "data_features": {
    "feature": [
      {
        "data_type": "nominal",
        "index": "0",
        "is_ignore": "false",
        "is_row_identifier": "true",
        "is_target": "false",
        "name": "molecule_id",
        "nominal_value": [
          "CHEMBL1337166",
          "CHEMBL2169897",
          "CHEMBL2170907",
          "CHEMBL2170908",
          "CHEMBL2170909",
          "CHEMBL2170910",
          "CHEMBL2170911",
          "CHEMBL2170912",
          "CHEMBL2170913",
          "CHEMBL2170914",
          "CHEMBL2170915",
          "CHEMBL2170916",
          "CHEMBL2170917",
          "CHEMBL2170918",
          "CHEMBL2170919",
          "CHEMBL2170920",
          "CHEMBL2170921",
          "CHEMBL2170922",
          "CHEMBL2170923",
          "CHEMBL2170924",
          "CHEMBL2170925",
          "CHEMBL2170926",
          "CHEMBL2170927",
          "CHEMBL2170928",
          "CHEMBL2170929",
          "CHEMBL2170930",
          "CHEMBL2170931",
          "CHEMBL2170932",
          "CHEMBL2170933",
          "CHEMBL2170934",
          "CHEMBL2170935",
          "CHEMBL2170936",
          "CHEMBL2170937",
          "CHEMBL2170938",
          "CHEMBL2170939",
          "CHEMBL2170940",
          "CHEMBL2170941",
          "CHEMBL2170942",
          "CHEMBL2170943",
          "CHEMBL2170944",
          "CHEMBL2170945",
          "CHEMBL2171110",
          "CHEMBL2171111",
          "CHEMBL2171112",
          "CHEMBL2171113"
        ],
        "number_of_missing_values": "0"
      },
      {
        "data_type": "numeric",
        "index": "1",
        "is_ignore": "false",
        "is_row_identifier": "false",
        "is_target": "false",
        "name": "AMW",
        "number_of_missing_values": "0"
      },
      {
        "data_type": "numeric",
        "index": "2",
        "is_ignore": "false",
        "is_row_identifier": "false",
        "is_target": "false",
        "name": "C.",
        "number_of_missing_values": "0"
      },
      {
        "data_type": "numeric",
        "index": "3",
        "is_ignore": "false",
        "is_row_identifier": "false",
        "is_target": "false",
        "name": "H.",
        "number_of_missing_values": "0"
      },
      {
        "data_type": "numeric",
        "index": "4",
        "is_ignore": "false",
        "is_row_identifier": "false",
        "is_target": "false",
        "name": "Me",
        "number_of_missing_values": "0"
      },
      {
        "data_type": "numeric",
        "index": "5",
        "is_ignore": "false",
        "is_row_identifier": "false",
        "is_target": "false",
        "name": "Mi",
        "number_of_missing_values": "0"
      },
      {
        "data_type": "numeric",
        "index": "6",
        "is_ignore": "false",
        "is_row_identifier": "false",
        "is_target": "false",
        "name": "Mp",
        "number_of_missing_values": "0"
      },
      {
        "data_type": "numeric",
        "index": "7",
        "is_ignore": "false",
        "is_row_identifier": "false",
        "is_target": "true",
        "name": "pXC50",
        "number_of_missing_values": "0"
      }
    ]
  }
}