{
  "data_features": {
    "feature": [
      {
        "data_type": "nominal",
        "index": "0",
        "is_ignore": "false",
        "is_row_identifier": "true",
        "is_target": "false",
        "name": "molecule_id",
        "nominal_value": [
          "CHEMBL1007",
          "CHEMBL1088865",
          "CHEMBL1088866",
          "CHEMBL1091209",
          "CHEMBL1091579",
          "CHEMBL1091580",
          "CHEMBL1091901",
          "CHEMBL1092245",
          "CHEMBL1092626",
          "CHEMBL1092627",
          "CHEMBL1092638",
          "CHEMBL10931",
          "CHEMBL110052",
          "CHEMBL11149",
          "CHEMBL111820",
          "CHEMBL111933",
          "CHEMBL111980",
          "CHEMBL112093",
          "CHEMBL112131",
          "CHEMBL112188",
          "CHEMBL112287",
          "CHEMBL112378",
          "CHEMBL112400",
          "CHEMBL112461",
          "CHEMBL112466",
          "CHEMBL112559",
          "CHEMBL112611",
          "CHEMBL112625",
          "CHEMBL112730",
          "CHEMBL112881",
          "CHEMBL113059",
          "CHEMBL113068",
          "CHEMBL113151",
          "CHEMBL113183",
          "CHEMBL113216",
          "CHEMBL113432",
          "CHEMBL113455",
          "CHEMBL113574",
          "CHEMBL114183",
          "CHEMBL114370",
          "CHEMBL114399",
          "CHEMBL114438",
          "CHEMBL114619",
          "CHEMBL115192",
          "CHEMBL115365",
          "CHEMBL115425",
          "CHEMBL115482",
          "CHEMBL115703",
          "CHEMBL115965",
          "CHEMBL116071",
          "CHEMBL116074",
          "CHEMBL116246",
          "CHEMBL116259",
          "CHEMBL116576",
          "CHEMBL116611",
          "CHEMBL116976",
          "CHEMBL116986",
          "CHEMBL116988",
          "CHEMBL116989",
          "CHEMBL117069",
          "CHEMBL117170",
          "CHEMBL117330",
          "CHEMBL117346",
          "CHEMBL117396",
          "CHEMBL117504",
          "CHEMBL117637",
          "CHEMBL117670",
          "CHEMBL117736",
          "CHEMBL117863",
          "CHEMBL117977",
          "CHEMBL118330",
          "CHEMBL119149",
          "CHEMBL119185",
          "CHEMBL119391",
          "CHEMBL119546",
          "CHEMBL119739",
          "CHEMBL119774",
          "CHEMBL119808",
          "CHEMBL119856",
          "CHEMBL120048",
          "CHEMBL1200490",
          "CHEMBL1201199",
          "CHEMBL120149",
          "CHEMBL120164",
          "CHEMBL120260",
          "CHEMBL120397",
          "CHEMBL120420",
          "CHEMBL120432",
          "CHEMBL120834",
          "CHEMBL121145",
          "CHEMBL121367",
          "CHEMBL121412",
          "CHEMBL121441",
          "CHEMBL121535",
          "CHEMBL121551",
          "CHEMBL121576",
          "CHEMBL12204",
          "CHEMBL122064",
          "CHEMBL12265",
          "CHEMBL122653",
          "CHEMBL12282",
          "CHEMBL123284",
          "CHEMBL123301",
          "CHEMBL124056",
          "CHEMBL1251",
          "CHEMBL1252",
          "CHEMBL12589",
          "CHEMBL12666",
          "CHEMBL127384",
          "CHEMBL127502",
          "CHEMBL128262",
          "CHEMBL128810",
          "CHEMBL129010",
          "CHEMBL130126",
          "CHEMBL130195",
          "CHEMBL130400",
          "CHEMBL130487",
          "CHEMBL130513",
          "CHEMBL130558",
          "CHEMBL130607",
          "CHEMBL130855",
          "CHEMBL130861",
          "CHEMBL131127",
          "CHEMBL131182",
          "CHEMBL131589",
          "CHEMBL131665",
          "CHEMBL131751",
          "CHEMBL131942",
          "CHEMBL132179",
          "CHEMBL132338",
          "CHEMBL132339",
          "CHEMBL132387",
          "CHEMBL132392",
          "CHEMBL132616",
          "CHEMBL132661",
          "CHEMBL135103",
          "CHEMBL138464",
          "CHEMBL138747",
          "CHEMBL138866",
          "CHEMBL138977",
          "CHEMBL138999",
          "CHEMBL139291",
          "CHEMBL139292",
          "CHEMBL139993",
          "CHEMBL141221",
          "CHEMBL141539",
          "CHEMBL141750",
          "CHEMBL157412",
          "CHEMBL165456",
          "CHEMBL165534",
          "CHEMBL166649",
          "CHEMBL166763",
          "CHEMBL166778",
          "CHEMBL166843",
          "CHEMBL16745",
          "CHEMBL168498",
          "CHEMBL168506",
          "CHEMBL168538",
          "CHEMBL168539",
          "CHEMBL168563",
          "CHEMBL168615",
          "CHEMBL168637",
          "CHEMBL168649",
          "CHEMBL168655",
          "CHEMBL168726",
          "CHEMBL169238",
          "CHEMBL169569",
          "CHEMBL169620",
          "CHEMBL169873",
          "CHEMBL170159",
          "CHEMBL170499",
          "CHEMBL170606",
          "CHEMBL172192",
          "CHEMBL175443",
          "CHEMBL175465",
          "CHEMBL175491",
          "CHEMBL175711",
          "CHEMBL175821",
          "CHEMBL175869",
          "CHEMBL176020",
          "CHEMBL176029",
          "CHEMBL176056",
          "CHEMBL176270",
          "CHEMBL176284",
          "CHEMBL1766106",
          "CHEMBL1766108",
          "CHEMBL177182",
          "CHEMBL177523",
          "CHEMBL178127",
          "CHEMBL178142",
          "CHEMBL178218",
          "CHEMBL178281",
          "CHEMBL178457",
          "CHEMBL178805",
          "CHEMBL178961",
          "CHEMBL179023",
          "CHEMBL179101",
          "CHEMBL179212",
          "CHEMBL179269",
          "CHEMBL179429",
          "CHEMBL179460",
          "CHEMBL179531",
          "CHEMBL179600",
          "CHEMBL179612",
          "CHEMBL179663",
          "CHEMBL179691",
          "CHEMBL179850",
          "CHEMBL179885",
          "CHEMBL179953",
          "CHEMBL179977",
          "CHEMBL1800150",
          "CHEMBL1800151",
          "CHEMBL1800152",
          "CHEMBL1800153",
          "CHEMBL1800154",
          "CHEMBL1800155",
          "CHEMBL1800156",
          "CHEMBL1800157",
          "CHEMBL1800158",
          "CHEMBL1800159",
          "CHEMBL1800661",
          "CHEMBL1800662",
          "CHEMBL1800663",
          "CHEMBL1800664",
          "CHEMBL1800665",
          "CHEMBL1800666",
          "CHEMBL1800667",
          "CHEMBL1800668",
          "CHEMBL1800669",
          "CHEMBL1800670",
          "CHEMBL180076",
          "CHEMBL180117",
          "CHEMBL180124",
          "CHEMBL180167",
          "CHEMBL180262",
          "CHEMBL180280",
          "CHEMBL180352",
          "CHEMBL180372",
          "CHEMBL180421",
          "CHEMBL181057",
          "CHEMBL181257",
          "CHEMBL181301",
          "CHEMBL181582",
          "CHEMBL181864",
          "CHEMBL181945",
          "CHEMBL182145",
          "CHEMBL182178",
          "CHEMBL182284",
          "CHEMBL182513",
          "CHEMBL182639",
          "CHEMBL182893",
          "CHEMBL183066",
          "CHEMBL183197",
          "CHEMBL183237",
          "CHEMBL183274",
          "CHEMBL183325",
          "CHEMBL183330",
          "CHEMBL183376",
          "CHEMBL183430",
          "CHEMBL183572",
          "CHEMBL183600",
          "CHEMBL183698",
          "CHEMBL183779",
          "CHEMBL183847",
          "CHEMBL183938",
          "CHEMBL184345",
          "CHEMBL184819",
          "CHEMBL184855",
          "CHEMBL185143",
          "CHEMBL185154",
          "CHEMBL185438",
          "CHEMBL185738",
          "CHEMBL185785",
          "CHEMBL185986",
          "CHEMBL186563",
          "CHEMBL186646",
          "CHEMBL187217",
          "CHEMBL187243",
          "CHEMBL189164",
          "CHEMBL189964",
          "CHEMBL189984",
          "CHEMBL190671",
          "CHEMBL190676",
          "CHEMBL190929",
          "CHEMBL191817",
          "CHEMBL192096",
          "CHEMBL192171",
          "CHEMBL192172",
          "CHEMBL192912",
          "CHEMBL192955",
          "CHEMBL193031",
          "CHEMBL193089",
          "CHEMBL193529",
          "CHEMBL193689",
          "CHEMBL193740",
          "CHEMBL193749",
          "CHEMBL193897",
          "CHEMBL194074",
          "CHEMBL195516",
          "CHEMBL195626",
          "CHEMBL195726",
          "CHEMBL195920",
          "CHEMBL195924",
          "CHEMBL196040",
          "CHEMBL196079",
          "CHEMBL196088",
          "CHEMBL196288",
          "CHEMBL196337",
          "CHEMBL196351",
          "CHEMBL196439",
          "CHEMBL196616",
          "CHEMBL197089",
          "CHEMBL197254",
          "CHEMBL197317",
          "CHEMBL2023087",
          "CHEMBL2023088",
          "CHEMBL20511",
          "CHEMBL206964",
          "CHEMBL208714",
          "CHEMBL208812",
          "CHEMBL2088253",
          "CHEMBL2088506",
          "CHEMBL208904",
          "CHEMBL2092994",
          "CHEMBL209419",
          "CHEMBL2096778",
          "CHEMBL209836",
          "CHEMBL209880",
          "CHEMBL210277",
          "CHEMBL210294",
          "CHEMBL210295",
          "CHEMBL210321",
          "CHEMBL210514",
          "CHEMBL210709",
          "CHEMBL210845",
          "CHEMBL210888",
          "CHEMBL211098",
          "CHEMBL2111955",
          "CHEMBL2111956",
          "CHEMBL21126",
          "CHEMBL2113012",
          "CHEMBL211485",
          "CHEMBL211503",
          "CHEMBL211588",
          "CHEMBL211731",
          "CHEMBL211752",
          "CHEMBL211808",
          "CHEMBL21185",
          "CHEMBL212051",
          "CHEMBL212121",
          "CHEMBL21217",
          "CHEMBL212207",
          "CHEMBL212472",
          "CHEMBL21373",
          "CHEMBL216252",
          "CHEMBL21704",
          "CHEMBL21804",
          "CHEMBL219061",
          "CHEMBL21936",
          "CHEMBL219461",
          "CHEMBL219532",
          "CHEMBL219562",
          "CHEMBL219799",
          "CHEMBL22055",
          "CHEMBL22196",
          "CHEMBL22300",
          "CHEMBL22314",
          "CHEMBL22459",
          "CHEMBL22559",
          "CHEMBL22563",
          "CHEMBL22653",
          "CHEMBL227451",
          "CHEMBL227861",
          "CHEMBL228197",
          "CHEMBL22852",
          "CHEMBL22929",
          "CHEMBL22937",
          "CHEMBL231739",
          "CHEMBL231760",
          "CHEMBL231761",
          "CHEMBL231954",
          "CHEMBL23198",
          "CHEMBL232097",
          "CHEMBL232150",
          "CHEMBL232151",
          "CHEMBL23231",
          "CHEMBL232356",
          "CHEMBL23237",
          "CHEMBL23256",
          "CHEMBL232752",
          "CHEMBL23321",
          "CHEMBL233341",
          "CHEMBL23337",
          "CHEMBL233761",
          "CHEMBL233762",
          "CHEMBL235046",
          "CHEMBL235050",
          "CHEMBL235051",
          "CHEMBL235084",
          "CHEMBL235179",
          "CHEMBL235269",
          "CHEMBL235270",
          "CHEMBL235301",
          "CHEMBL235302",
          "CHEMBL235519",
          "CHEMBL235520",
          "CHEMBL23604",
          "CHEMBL236127",
          "CHEMBL236137",
          "CHEMBL236142",
          "CHEMBL236152",
          "CHEMBL236154",
          "CHEMBL236197",
          "CHEMBL236331",
          "CHEMBL236332",
          "CHEMBL236342",
          "CHEMBL236348",
          "CHEMBL236544",
          "CHEMBL236545",
          "CHEMBL236546",
          "CHEMBL236550",
          "CHEMBL23673",
          "CHEMBL236750",
          "CHEMBL236751",
          "CHEMBL236964",
          "CHEMBL236965",
          "CHEMBL236966",
          "CHEMBL236967",
          "CHEMBL23729",
          "CHEMBL23730",
          "CHEMBL23737",
          "CHEMBL23767",
          "CHEMBL237734",
          "CHEMBL237834",
          "CHEMBL23797",
          "CHEMBL238160",
          "CHEMBL23823",
          "CHEMBL23830",
          "CHEMBL23854",
          "CHEMBL23900",
          "CHEMBL23908",
          "CHEMBL23969",
          "CHEMBL242399",
          "CHEMBL249372",
          "CHEMBL249771",
          "CHEMBL249772",
          "CHEMBL249982",
          "CHEMBL250389",
          "CHEMBL250568",
          "CHEMBL250569",
          "CHEMBL250770",
          "CHEMBL251388",
          "CHEMBL251578",
          "CHEMBL255242",
          "CHEMBL256109",
          "CHEMBL25714",
          "CHEMBL257599",
          "CHEMBL258970",
          "CHEMBL259220",
          "CHEMBL259878",
          "CHEMBL259906",
          "CHEMBL259907",
          "CHEMBL260058",
          "CHEMBL260062",
          "CHEMBL260318",
          "CHEMBL260540",
          "CHEMBL260552",
          "CHEMBL260647",
          "CHEMBL260750",
          "CHEMBL260812",
          "CHEMBL260816",
          "CHEMBL261145",
          "CHEMBL261649",
          "CHEMBL261979",
          "CHEMBL262180",
          "CHEMBL262334",
          "CHEMBL262335",
          "CHEMBL262557",
          "CHEMBL262579",
          "CHEMBL262580",
          "CHEMBL262581",
          "CHEMBL262599",
          "CHEMBL262747",
          "CHEMBL262787",
          "CHEMBL263004",
          "CHEMBL263118",
          "CHEMBL263507",
          "CHEMBL263691",
          "CHEMBL264043",
          "CHEMBL264090",
          "CHEMBL264121",
          "CHEMBL264193",
          "CHEMBL264574",
          "CHEMBL264779",
          "CHEMBL264781",
          "CHEMBL264806",
          "CHEMBL265020",
          "CHEMBL265042",
          "CHEMBL265286",
          "CHEMBL265288",
          "CHEMBL265543",
          "CHEMBL265556",
          "CHEMBL265775",
          "CHEMBL265879",
          "CHEMBL266172",
          "CHEMBL266420",
          "CHEMBL266444",
          "CHEMBL266653",
          "CHEMBL266716",
          "CHEMBL266728",
          "CHEMBL266893",
          "CHEMBL267568",
          "CHEMBL267622",
          "CHEMBL267838",
          "CHEMBL267873",
          "CHEMBL268146",
          "CHEMBL268297",
          "CHEMBL268450",
          "CHEMBL268489",
          "CHEMBL268491",
          "CHEMBL268813",
          "CHEMBL268829",
          "CHEMBL268875",
          "CHEMBL269516",
          "CHEMBL269711",
          "CHEMBL269726",
          "CHEMBL273275",
          "CHEMBL273358",
          "CHEMBL273387",
          "CHEMBL273390",
          "CHEMBL273440",
          "CHEMBL273466",
          "CHEMBL273535",
          "CHEMBL273536",
          "CHEMBL274002",
          "CHEMBL275251",
          "CHEMBL275467",
          "CHEMBL275521",
          "CHEMBL275935",
          "CHEMBL276217",
          "CHEMBL277214",
          "CHEMBL277435",
          "CHEMBL277436",
          "CHEMBL277439",
          "CHEMBL277653",
          "CHEMBL279223",
          "CHEMBL279885",
          "CHEMBL280126",
          "CHEMBL280170",
          "CHEMBL280212",
          "CHEMBL280213",
          "CHEMBL280350",
          "CHEMBL280365",
          "CHEMBL280430",
          "CHEMBL280664",
          "CHEMBL281167",
          "CHEMBL281776",
          "CHEMBL282679",
          "CHEMBL282707",
          "CHEMBL283170",
          "CHEMBL283381",
          "CHEMBL288396",
          "CHEMBL288534",
          "CHEMBL290991",
          "CHEMBL291893",
          "CHEMBL291896",
          "CHEMBL292291",
          "CHEMBL292773",
          "CHEMBL293247",
          "CHEMBL293921",
          "CHEMBL295275",
          "CHEMBL295376",
          "CHEMBL295595",
          "CHEMBL295641",
          "CHEMBL295807",
          "CHEMBL295897",
          "CHEMBL295917",
          "CHEMBL295948",
          "CHEMBL296199",
          "CHEMBL296426",
          "CHEMBL296442",
          "CHEMBL297269",
          "CHEMBL297491",
          "CHEMBL297703",
          "CHEMBL297938",
          "CHEMBL298051",
          "CHEMBL298366",
          "CHEMBL298497",
          "CHEMBL298700",
          "CHEMBL298937",
          "CHEMBL298982",
          "CHEMBL299006",
          "CHEMBL299301",
          "CHEMBL299320",
          "CHEMBL299335",
          "CHEMBL299348",
          "CHEMBL299392",
          "CHEMBL299615",
          "CHEMBL299850",
          "CHEMBL300079",
          "CHEMBL300080",
          "CHEMBL300295",
          "CHEMBL300484",
          "CHEMBL300792",
          "CHEMBL300865",
          "CHEMBL301103",
          "CHEMBL301285",
          "CHEMBL301322",
          "CHEMBL301802",
          "CHEMBL302769",
          "CHEMBL303140",
          "CHEMBL303260",
          "CHEMBL303274",
          "CHEMBL303621",
          "CHEMBL303811",
          "CHEMBL304002",
          "CHEMBL304067",
          "CHEMBL304156",
          "CHEMBL304308",
          "CHEMBL304548",
          "CHEMBL304633",
          "CHEMBL304950",
          "CHEMBL305034",
          "CHEMBL305155",
          "CHEMBL305672",
          "CHEMBL306431",
          "CHEMBL306684",
          "CHEMBL308154",
          "CHEMBL308289",
          "CHEMBL308446",
          "CHEMBL308696",
          "CHEMBL308765",
          "CHEMBL308910",
          "CHEMBL310716",
          "CHEMBL311380",
          "CHEMBL311407",
          "CHEMBL312864",
          "CHEMBL312995",
          "CHEMBL313004",
          "CHEMBL313086",
          "CHEMBL313946",
          "CHEMBL314260",
          "CHEMBL314860",
          "CHEMBL315325",
          "CHEMBL315326",
          "CHEMBL315909",
          "CHEMBL316159",
          "CHEMBL316362",
          "CHEMBL320920",
          "CHEMBL321258",
          "CHEMBL321376",
          "CHEMBL322283",
          "CHEMBL323687",
          "CHEMBL323863",
          "CHEMBL324375",
          "CHEMBL324394",
          "CHEMBL324654",
          "CHEMBL324759",
          "CHEMBL324771",
          "CHEMBL324912",
          "CHEMBL325091",
          "CHEMBL325233",
          "CHEMBL325326",
          "CHEMBL325391",
          "CHEMBL325417",
          "CHEMBL325747",
          "CHEMBL325843",
          "CHEMBL325942",
          "CHEMBL326313",
          "CHEMBL326504",
          "CHEMBL326510",
          "CHEMBL326606",
          "CHEMBL326804",
          "CHEMBL326885",
          "CHEMBL327076",
          "CHEMBL327704",
          "CHEMBL330804",
          "CHEMBL330834",
          "CHEMBL330835",
          "CHEMBL331087",
          "CHEMBL331144",
          "CHEMBL331145",
          "CHEMBL331204",
          "CHEMBL331277",
          "CHEMBL331337",
          "CHEMBL331592",
          "CHEMBL331762",
          "CHEMBL331855",
          "CHEMBL332049",
          "CHEMBL332138",
          "CHEMBL332194",
          "CHEMBL332305",
          "CHEMBL332355",
          "CHEMBL332463",
          "CHEMBL332570",
          "CHEMBL332616",
          "CHEMBL332837",
          "CHEMBL332923",
          "CHEMBL333103",
          "CHEMBL333213",
          "CHEMBL333233",
          "CHEMBL333345",
          "CHEMBL333349",
          "CHEMBL333461",
          "CHEMBL333518",
          "CHEMBL333574",
          "CHEMBL333614",
          "CHEMBL333730",
          "CHEMBL333850",
          "CHEMBL334037",
          "CHEMBL334063",
          "CHEMBL334110",
          "CHEMBL334148",
          "CHEMBL334537",
          "CHEMBL334729",
          "CHEMBL334816",
          "CHEMBL334904",
          "CHEMBL335196",
          "CHEMBL335610",
          "CHEMBL335647",
          "CHEMBL335650",
          "CHEMBL335764",
          "CHEMBL336039",
          "CHEMBL336319",
          "CHEMBL336884",
          "CHEMBL337172",
          "CHEMBL337323",
          "CHEMBL337433",
          "CHEMBL337748",
          "CHEMBL337865",
          "CHEMBL337891",
          "CHEMBL337919",
          "CHEMBL339211",
          "CHEMBL339273",
          "CHEMBL339468",
          "CHEMBL339636",
          "CHEMBL339968",
          "CHEMBL340156",
          "CHEMBL340524",
          "CHEMBL340677",
          "CHEMBL340856",
          "CHEMBL340934",
          "CHEMBL341124",
          "CHEMBL341717",
          "CHEMBL341809",
          "CHEMBL342396",
          "CHEMBL342822",
          "CHEMBL342908",
          "CHEMBL343040",
          "CHEMBL343396",
          "CHEMBL344688",
          "CHEMBL349638",
          "CHEMBL351836",
          "CHEMBL352051",
          "CHEMBL352565",
          "CHEMBL352566",
          "CHEMBL352782",
          "CHEMBL352806",
          "CHEMBL353308",
          "CHEMBL353395",
          "CHEMBL354524",
          "CHEMBL359558",
          "CHEMBL359668",
          "CHEMBL359681",
          "CHEMBL359682",
          "CHEMBL359741",
          "CHEMBL359754",
          "CHEMBL359810",
          "CHEMBL359860",
          "CHEMBL359868",
          "CHEMBL359894",
          "CHEMBL359914",
          "CHEMBL360047",
          "CHEMBL360056",
          "CHEMBL360126",
          "CHEMBL360143",
          "CHEMBL360244",
          "CHEMBL360297",
          "CHEMBL360363",
          "CHEMBL360367",
          "CHEMBL360384",
          "CHEMBL360429",
          "CHEMBL360447",
          "CHEMBL360472",
          "CHEMBL360625",
          "CHEMBL360693",
          "CHEMBL360743",
          "CHEMBL360910",
          "CHEMBL360934",
          "CHEMBL360935",
          "CHEMBL361016",
          "CHEMBL361124",
          "CHEMBL361128",
          "CHEMBL361313",
          "CHEMBL361513",
          "CHEMBL361619",
          "CHEMBL361798",
          "CHEMBL362025",
          "CHEMBL362065",
          "CHEMBL362237",
          "CHEMBL362283",
          "CHEMBL362371",
          "CHEMBL362403",
          "CHEMBL362544",
          "CHEMBL363094",
          "CHEMBL363659",
          "CHEMBL363663",
          "CHEMBL363731",
          "CHEMBL363759",
          "CHEMBL363900",
          "CHEMBL364167",
          "CHEMBL364246",
          "CHEMBL364297",
          "CHEMBL364510",
          "CHEMBL364840",
          "CHEMBL364842",
          "CHEMBL364914",
          "CHEMBL364933",
          "CHEMBL365001",
          "CHEMBL365012",
          "CHEMBL365366",
          "CHEMBL365561",
          "CHEMBL365695",
          "CHEMBL365985",
          "CHEMBL366020",
          "CHEMBL366127",
          "CHEMBL366236",
          "CHEMBL366701",
          "CHEMBL366865",
          "CHEMBL366883",
          "CHEMBL367369",
          "CHEMBL367388",
          "CHEMBL367548",
          "CHEMBL367806",
          "CHEMBL367812",
          "CHEMBL368153",
          "CHEMBL368511",
          "CHEMBL369101",
          "CHEMBL369326",
          "CHEMBL369453",
          "CHEMBL369706",
          "CHEMBL369723",
          "CHEMBL369749",
          "CHEMBL370028",
          "CHEMBL370144",
          "CHEMBL370145",
          "CHEMBL370414",
          "CHEMBL370480",
          "CHEMBL370587",
          "CHEMBL370603",
          "CHEMBL370623",
          "CHEMBL370711",
          "CHEMBL371073",
          "CHEMBL371613",
          "CHEMBL371722",
          "CHEMBL371855",
          "CHEMBL372316",
          "CHEMBL372455",
          "CHEMBL372680",
          "CHEMBL373340",
          "CHEMBL373724",
          "CHEMBL373725",
          "CHEMBL374747",
          "CHEMBL376466",
          "CHEMBL376654",
          "CHEMBL376728",
          "CHEMBL377015",
          "CHEMBL377396",
          "CHEMBL378481",
          "CHEMBL378654",
          "CHEMBL378845",
          "CHEMBL378979",
          "CHEMBL379198",
          "CHEMBL379274",
          "CHEMBL379629",
          "CHEMBL380200",
          "CHEMBL380576",
          "CHEMBL382747",
          "CHEMBL383393",
          "CHEMBL384898",
          "CHEMBL384920",
          "CHEMBL385175",
          "CHEMBL386105",
          "CHEMBL387006",
          "CHEMBL387499",
          "CHEMBL388156",
          "CHEMBL388369",
          "CHEMBL389248",
          "CHEMBL389945",
          "CHEMBL392008",
          "CHEMBL392087",
          "CHEMBL392434",
          "CHEMBL392446",
          "CHEMBL392480",
          "CHEMBL392602",
          "CHEMBL392603",
          "CHEMBL392604",
          "CHEMBL392605",
          "CHEMBL392606",
          "CHEMBL392607",
          "CHEMBL392688",
          "CHEMBL392709",
          "CHEMBL392731",
          "CHEMBL392733",
          "CHEMBL392815",
          "CHEMBL392843",
          "CHEMBL393092",
          "CHEMBL393093",
          "CHEMBL393206",
          "CHEMBL393540",
          "CHEMBL393577",
          "CHEMBL394613",
          "CHEMBL394634",
          "CHEMBL395183",
          "CHEMBL395225",
          "CHEMBL395825",
          "CHEMBL395826",
          "CHEMBL398060",
          "CHEMBL398583",
          "CHEMBL398648",
          "CHEMBL399772",
          "CHEMBL399779",
          "CHEMBL399856",
          "CHEMBL399857",
          "CHEMBL400390",
          "CHEMBL400739",
          "CHEMBL401080",
          "CHEMBL401081",
          "CHEMBL401193",
          "CHEMBL401212",
          "CHEMBL401225",
          "CHEMBL401226",
          "CHEMBL401349",
          "CHEMBL401350",
          "CHEMBL401351",
          "CHEMBL401352",
          "CHEMBL401418",
          "CHEMBL401632",
          "CHEMBL401807",
          "CHEMBL402671",
          "CHEMBL402683",
          "CHEMBL403081",
          "CHEMBL403234",
          "CHEMBL404180",
          "CHEMBL404611",
          "CHEMBL404973",
          "CHEMBL405273",
          "CHEMBL405449",
          "CHEMBL405548",
          "CHEMBL405814",
          "CHEMBL405951",
          "CHEMBL406084",
          "CHEMBL406225",
          "CHEMBL406337",
          "CHEMBL406535",
          "CHEMBL406713",
          "CHEMBL406958",
          "CHEMBL406960",
          "CHEMBL407399",
          "CHEMBL40743",
          "CHEMBL407619",
          "CHEMBL407661",
          "CHEMBL407719",
          "CHEMBL408746",
          "CHEMBL408759",
          "CHEMBL408760",
          "CHEMBL408925",
          "CHEMBL409043",
          "CHEMBL409044",
          "CHEMBL409138",
          "CHEMBL409825",
          "CHEMBL410165",
          "CHEMBL410547",
          "CHEMBL410601",
          "CHEMBL410680",
          "CHEMBL410940",
          "CHEMBL410967",
          "CHEMBL411337",
          "CHEMBL411381",
          "CHEMBL411526",
          "CHEMBL411565",
          "CHEMBL411749",
          "CHEMBL411987",
          "CHEMBL412212",
          "CHEMBL412336",
          "CHEMBL412500",
          "CHEMBL412581",
          "CHEMBL412634",
          "CHEMBL412749",
          "CHEMBL412794",
          "CHEMBL413062",
          "CHEMBL413216",
          "CHEMBL413238",
          "CHEMBL413239",
          "CHEMBL413245",
          "CHEMBL413450",
          "CHEMBL413688",
          "CHEMBL413698",
          "CHEMBL414061",
          "CHEMBL414249",
          "CHEMBL414266",
          "CHEMBL414344",
          "CHEMBL414346",
          "CHEMBL414347",
          "CHEMBL414507",
          "CHEMBL414514",
          "CHEMBL414715",
          "CHEMBL414899",
          "CHEMBL415279",
          "CHEMBL415328",
          "CHEMBL415380",
          "CHEMBL415432",
          "CHEMBL415547",
          "CHEMBL415549",
          "CHEMBL415573",
          "CHEMBL415595",
          "CHEMBL415606",
          "CHEMBL415622",
          "CHEMBL415659",
          "CHEMBL415813",
          "CHEMBL415820",
          "CHEMBL416337",
          "CHEMBL416651",
          "CHEMBL417189",
          "CHEMBL417363",
          "CHEMBL417558",
          "CHEMBL417645",
          "CHEMBL417720",
          "CHEMBL418067",
          "CHEMBL418256",
          "CHEMBL419212",
          "CHEMBL419270",
          "CHEMBL419998",
          "CHEMBL420051",
          "CHEMBL420200",
          "CHEMBL421160",
          "CHEMBL421418",
          "CHEMBL421858",
          "CHEMBL423291",
          "CHEMBL424991",
          "CHEMBL425051",
          "CHEMBL425178",
          "CHEMBL425486",
          "CHEMBL425523",
          "CHEMBL425524",
          "CHEMBL425529",
          "CHEMBL425813",
          "CHEMBL425864",
          "CHEMBL426058",
          "CHEMBL426060",
          "CHEMBL426155",
          "CHEMBL426780",
          "CHEMBL426783",
          "CHEMBL427146",
          "CHEMBL427269",
          "CHEMBL427438",
          "CHEMBL427500",
          "CHEMBL427976",
          "CHEMBL427981",
          "CHEMBL428008",
          "CHEMBL428323",
          "CHEMBL428484",
          "CHEMBL428795",
          "CHEMBL428825",
          "CHEMBL429016",
          "CHEMBL429062",
          "CHEMBL429378",
          "CHEMBL429527",
          "CHEMBL429690",
          "CHEMBL429949",
          "CHEMBL429956",
          "CHEMBL429976",
          "CHEMBL430069",
          "CHEMBL430171",
          "CHEMBL430250",
          "CHEMBL430312",
          "CHEMBL430613",
          "CHEMBL430618",
          "CHEMBL430763",
          "CHEMBL431248",
          "CHEMBL431402",
          "CHEMBL432262",
          "CHEMBL432450",
          "CHEMBL432585",
          "CHEMBL432922",
          "CHEMBL433302",
          "CHEMBL433594",
          "CHEMBL433954",
          "CHEMBL434371",
          "CHEMBL434380",
          "CHEMBL434423",
          "CHEMBL434621",
          "CHEMBL434906",
          "CHEMBL434936",
          "CHEMBL434955",
          "CHEMBL434995",
          "CHEMBL435141",
          "CHEMBL435167",
          "CHEMBL435262",
          "CHEMBL435322",
          "CHEMBL435334",
          "CHEMBL435689",
          "CHEMBL435784",
          "CHEMBL435793",
          "CHEMBL435925",
          "CHEMBL435974",
          "CHEMBL436276",
          "CHEMBL436346",
          "CHEMBL436472",
          "CHEMBL436663",
          "CHEMBL436697",
          "CHEMBL436862",
          "CHEMBL436874",
          "CHEMBL436878",
          "CHEMBL436906",
          "CHEMBL437260",
          "CHEMBL437672",
          "CHEMBL438018",
          "CHEMBL438168",
          "CHEMBL438201",
          "CHEMBL438239",
          "CHEMBL438629",
          "CHEMBL438652",
          "CHEMBL438897",
          "CHEMBL438905",
          "CHEMBL439076",
          "CHEMBL439860",
          "CHEMBL439879",
          "CHEMBL440212",
          "CHEMBL441208",
          "CHEMBL441211",
          "CHEMBL441676",
          "CHEMBL441893",
          "CHEMBL442283",
          "CHEMBL442308",
          "CHEMBL442482",
          "CHEMBL443027",
          "CHEMBL444381",
          "CHEMBL444509",
          "CHEMBL444989",
          "CHEMBL445074",
          "CHEMBL445143",
          "CHEMBL445691",
          "CHEMBL44627",
          "CHEMBL446978",
          "CHEMBL447424",
          "CHEMBL447592",
          "CHEMBL448253",
          "CHEMBL448656",
          "CHEMBL449351",
          "CHEMBL449373",
          "CHEMBL449468",
          "CHEMBL450414",
          "CHEMBL450471",
          "CHEMBL451916",
          "CHEMBL452044",
          "CHEMBL452198",
          "CHEMBL452293",
          "CHEMBL452474",
          "CHEMBL452547",
          "CHEMBL453167",
          "CHEMBL453441",
          "CHEMBL454774",
          "CHEMBL455769",
          "CHEMBL456279",
          "CHEMBL45784",
          "CHEMBL45883",
          "CHEMBL459215",
          "CHEMBL459659",
          "CHEMBL460480",
          "CHEMBL460892",
          "CHEMBL46177",
          "CHEMBL46312",
          "CHEMBL466531",
          "CHEMBL466541",
          "CHEMBL466730",
          "CHEMBL466731",
          "CHEMBL466735",
          "CHEMBL466736",
          "CHEMBL468348",
          "CHEMBL468546",
          "CHEMBL468551",
          "CHEMBL468552",
          "CHEMBL468564",
          "CHEMBL468565",
          "CHEMBL472117",
          "CHEMBL473807",
          "CHEMBL474991",
          "CHEMBL474992",
          "CHEMBL475650",
          "CHEMBL475660",
          "CHEMBL47791",
          "CHEMBL47895",
          "CHEMBL48165",
          "CHEMBL48192",
          "CHEMBL48193",
          "CHEMBL48249",
          "CHEMBL48316",
          "CHEMBL48380",
          "CHEMBL48389",
          "CHEMBL48616",
          "CHEMBL48641",
          "CHEMBL48674",
          "CHEMBL487627",
          "CHEMBL48806",
          "CHEMBL488478",
          "CHEMBL48879",
          "CHEMBL488812",
          "CHEMBL48944",
          "CHEMBL49230",
          "CHEMBL492327",
          "CHEMBL492587",
          "CHEMBL492780",
          "CHEMBL49297",
          "CHEMBL493167",
          "CHEMBL493185",
          "CHEMBL493344",
          "CHEMBL493565",
          "CHEMBL49366",
          "CHEMBL493730",
          "CHEMBL493731",
          "CHEMBL49374",
          "CHEMBL493794",
          "CHEMBL493931",
          "CHEMBL493932",
          "CHEMBL494021",
          "CHEMBL494232",
          "CHEMBL494400",
          "CHEMBL494415",
          "CHEMBL494416",
          "CHEMBL494548",
          "CHEMBL494554",
          "CHEMBL494621",
          "CHEMBL494738",
          "CHEMBL494739",
          "CHEMBL494797",
          "CHEMBL494968",
          "CHEMBL495174",
          "CHEMBL495183",
          "CHEMBL495189",
          "CHEMBL495190",
          "CHEMBL495882",
          "CHEMBL497747",
          "CHEMBL49872",
          "CHEMBL499026",
          "CHEMBL499307",
          "CHEMBL499442",
          "CHEMBL499588",
          "CHEMBL499589",
          "CHEMBL499849",
          "CHEMBL50009",
          "CHEMBL501329",
          "CHEMBL502182",
          "CHEMBL502341",
          "CHEMBL502967",
          "CHEMBL503624",
          "CHEMBL503705",
          "CHEMBL50380",
          "CHEMBL505033",
          "CHEMBL50546",
          "CHEMBL506338",
          "CHEMBL50663",
          "CHEMBL506877",
          "CHEMBL50721",
          "CHEMBL507973",
          "CHEMBL508020",
          "CHEMBL508435",
          "CHEMBL50856",
          "CHEMBL508898",
          "CHEMBL509075",
          "CHEMBL509267",
          "CHEMBL509347",
          "CHEMBL509440",
          "CHEMBL510285",
          "CHEMBL510538",
          "CHEMBL51232",
          "CHEMBL512893",
          "CHEMBL513126",
          "CHEMBL513346",
          "CHEMBL513998",
          "CHEMBL515123",
          "CHEMBL515200",
          "CHEMBL516479",
          "CHEMBL516934",
          "CHEMBL517881",
          "CHEMBL51841",
          "CHEMBL51983",
          "CHEMBL521674",
          "CHEMBL522188",
          "CHEMBL522202",
          "CHEMBL52278",
          "CHEMBL523527",
          "CHEMBL523709",
          "CHEMBL523711",
          "CHEMBL523849",
          "CHEMBL52506",
          "CHEMBL526327",
          "CHEMBL526887",
          "CHEMBL527422",
          "CHEMBL539167",
          "CHEMBL540109",
          "CHEMBL540207",
          "CHEMBL544440",
          "CHEMBL553990",
          "CHEMBL556355",
          "CHEMBL60153",
          "CHEMBL60618",
          "CHEMBL64066",
          "CHEMBL64148",
          "CHEMBL64212",
          "CHEMBL64252",
          "CHEMBL64273",
          "CHEMBL64795",
          "CHEMBL64920",
          "CHEMBL65569",
          "CHEMBL65614",
          "CHEMBL65769",
          "CHEMBL66808",
          "CHEMBL67370",
          "CHEMBL67638",
          "CHEMBL67820",
          "CHEMBL68537",
          "CHEMBL68625",
          "CHEMBL68664",
          "CHEMBL68698",
          "CHEMBL68753",
          "CHEMBL68964",
          "CHEMBL68985",
          "CHEMBL68988",
          "CHEMBL69361",
          "CHEMBL69914",
          "CHEMBL70276",
          "CHEMBL70851",
          "CHEMBL71141",
          "CHEMBL71400",
          "CHEMBL71561",
          "CHEMBL71793",
          "CHEMBL71917",
          "CHEMBL72199",
          "CHEMBL72606",
          "CHEMBL72913",
          "CHEMBL73454",
          "CHEMBL73526",
          "CHEMBL73575",
          "CHEMBL74686",
          "CHEMBL74716",
          "CHEMBL74721",
          "CHEMBL74925",
          "CHEMBL75347",
          "CHEMBL75439",
          "CHEMBL75954",
          "CHEMBL76277",
          "CHEMBL79639",
          "CHEMBL86431",
          "CHEMBL86758",
          "CHEMBL86805",
          "CHEMBL86911",
          "CHEMBL86912",
          "CHEMBL86950",
          "CHEMBL87000",
          "CHEMBL87099",
          "CHEMBL87785"
        ],
        "number_of_missing_values": "0"
      },
      {
        "data_type": "numeric",
        "index": "1",
        "is_ignore": "false",
        "is_row_identifier": "false",
        "is_target": "false",
        "name": "CATS2D_06_DD",
        "number_of_missing_values": "0"
      },
      {
        "data_type": "numeric",
        "index": "2",
        "is_ignore": "false",
        "is_row_identifier": "false",
        "is_target": "false",
        "name": "CATS2D_09_DD",
        "number_of_missing_values": "0"
      },
      {
        "data_type": "numeric",
        "index": "3",
        "is_ignore": "false",
        "is_row_identifier": "false",
        "is_target": "false",
        "name": "ATSC8s",
        "number_of_missing_values": "0"
      },
      {
        "data_type": "numeric",
        "index": "4",
        "is_ignore": "false",
        "is_row_identifier": "false",
        "is_target": "false",
        "name": "CATS2D_03_DA",
        "number_of_missing_values": "0"
      },
      {
        "data_type": "numeric",
        "index": "5",
        "is_ignore": "false",
        "is_row_identifier": "false",
        "is_target": "false",
        "name": "CATS2D_03_DD",
        "number_of_missing_values": "0"
      },
      {
        "data_type": "numeric",
        "index": "6",
        "is_ignore": "false",
        "is_row_identifier": "false",
        "is_target": "false",
        "name": "CATS2D_05_DA",
        "number_of_missing_values": "0"
      },
      {
        "data_type": "numeric",
        "index": "7",
        "is_ignore": "false",
        "is_row_identifier": "false",
        "is_target": "false",
        "name": "ATSC5e",
        "number_of_missing_values": "0"
      },
      {
        "data_type": "numeric",
        "index": "8",
        "is_ignore": "false",
        "is_row_identifier": "false",
        "is_target": "false",
        "name": "ATSC5s",
        "number_of_missing_values": "0"
      },
      {
        "data_type": "numeric",
        "index": "9",
        "is_ignore": "false",
        "is_row_identifier": "false",
        "is_target": "false",
        "name": "GATS2v",
        "number_of_missing_values": "0"
      },
      {
        "data_type": "numeric",
        "index": "10",
        "is_ignore": "false",
        "is_row_identifier": "false",
        "is_target": "false",
        "name": "nCs",
        "number_of_missing_values": "0"
      },
      {
        "data_type": "numeric",
        "index": "11",
        "is_ignore": "false",
        "is_row_identifier": "false",
        "is_target": "false",
        "name": "CATS2D_08_DD",
        "number_of_missing_values": "0"
      },
      {
        "data_type": "numeric",
        "index": "12",
        "is_ignore": "false",
        "is_row_identifier": "false",
        "is_target": "false",
        "name": "GATS2i",
        "number_of_missing_values": "0"
      },
      {
        "data_type": "numeric",
        "index": "13",
        "is_ignore": "false",
        "is_row_identifier": "false",
        "is_target": "false",
        "name": "D.Dtr10",
        "number_of_missing_values": "0"
      },
      {
        "data_type": "numeric",
        "index": "14",
        "is_ignore": "false",
        "is_row_identifier": "false",
        "is_target": "false",
        "name": "IDDE",
        "number_of_missing_values": "0"
      },
      {
        "data_type": "numeric",
        "index": "15",
        "is_ignore": "false",
        "is_row_identifier": "false",
        "is_target": "false",
        "name": "ATSC3m",
        "number_of_missing_values": "0"
      },
      {
        "data_type": "numeric",
        "index": "16",
        "is_ignore": "false",
        "is_row_identifier": "false",
        "is_target": "false",
        "name": "CATS2D_07_DD",
        "number_of_missing_values": "0"
      },
      {
        "data_type": "numeric",
        "index": "17",
        "is_ignore": "false",
        "is_row_identifier": "false",
        "is_target": "false",
        "name": "nOHp",
        "number_of_missing_values": "0"
      },
      {
        "data_type": "numeric",
        "index": "18",
        "is_ignore": "false",
        "is_row_identifier": "false",
        "is_target": "false",
        "name": "SpMin5_Bh.s.",
        "number_of_missing_values": "0"
      },
      {
        "data_type": "numeric",
        "index": "19",
        "is_ignore": "false",
        "is_row_identifier": "false",
        "is_target": "false",
        "name": "C.002",
        "number_of_missing_values": "0"
      },
      {
        "data_type": "numeric",
        "index": "20",
        "is_ignore": "false",
        "is_row_identifier": "false",
        "is_target": "false",
        "name": "SsOH",
        "number_of_missing_values": "0"
      },
      {
        "data_type": "numeric",
        "index": "21",
        "is_ignore": "false",
        "is_row_identifier": "false",
        "is_target": "false",
        "name": "CATS2D_03_DP",
        "number_of_missing_values": "0"
      },
      {
        "data_type": "numeric",
        "index": "22",
        "is_ignore": "false",
        "is_row_identifier": "false",
        "is_target": "false",
        "name": "ATSC6s",
        "number_of_missing_values": "0"
      },
      {
        "data_type": "numeric",
        "index": "23",
        "is_ignore": "false",
        "is_row_identifier": "false",
        "is_target": "false",
        "name": "SpMin6_Bh.s.",
        "number_of_missing_values": "0"
      },
      {
        "data_type": "numeric",
        "index": "24",
        "is_ignore": "false",
        "is_row_identifier": "false",
        "is_target": "false",
        "name": "ATSC5m",
        "number_of_missing_values": "0"
      },
      {
        "data_type": "numeric",
        "index": "25",
        "is_ignore": "false",
        "is_row_identifier": "false",
        "is_target": "false",
        "name": "ATSC7m",
        "number_of_missing_values": "0"
      },
      {
        "data_type": "numeric",
        "index": "26",
        "is_ignore": "false",
        "is_row_identifier": "false",
        "is_target": "false",
        "name": "ATSC3v",
        "number_of_missing_values": "0"
      },
      {
        "data_type": "numeric",
        "index": "27",
        "is_ignore": "false",
        "is_row_identifier": "false",
        "is_target": "false",
        "name": "CATS2D_02_AP",
        "number_of_missing_values": "0"
      },
      {
        "data_type": "numeric",
        "index": "28",
        "is_ignore": "false",
        "is_row_identifier": "false",
        "is_target": "false",
        "name": "nRCONH2",
        "number_of_missing_values": "0"
      },
      {
        "data_type": "numeric",
        "index": "29",
        "is_ignore": "false",
        "is_row_identifier": "false",
        "is_target": "false",
        "name": "ATSC4v",
        "number_of_missing_values": "0"
      },
      {
        "data_type": "numeric",
        "index": "30",
        "is_ignore": "false",
        "is_row_identifier": "false",
        "is_target": "false",
        "name": "SpMin4_Bh.s.",
        "number_of_missing_values": "0"
      },
      {
        "data_type": "numeric",
        "index": "31",
        "is_ignore": "false",
        "is_row_identifier": "false",
        "is_target": "false",
        "name": "MCD",
        "number_of_missing_values": "0"
      },
      {
        "data_type": "numeric",
        "index": "32",
        "is_ignore": "false",
        "is_row_identifier": "false",
        "is_target": "false",
        "name": "NsOH",
        "number_of_missing_values": "0"
      },
      {
        "data_type": "numeric",
        "index": "33",
        "is_ignore": "false",
        "is_row_identifier": "false",
        "is_target": "false",
        "name": "NdssC",
        "number_of_missing_values": "0"
      },
      {
        "data_type": "numeric",
        "index": "34",
        "is_ignore": "false",
        "is_row_identifier": "false",
        "is_target": "false",
        "name": "P_VSA_i_3",
        "number_of_missing_values": "0"
      },
      {
        "data_type": "numeric",
        "index": "35",
        "is_ignore": "false",
        "is_row_identifier": "false",
        "is_target": "false",
        "name": "ATSC2v",
        "number_of_missing_values": "0"
      },
      {
        "data_type": "numeric",
        "index": "36",
        "is_ignore": "false",
        "is_row_identifier": "false",
        "is_target": "false",
        "name": "ATSC1m",
        "number_of_missing_values": "0"
      },
      {
        "data_type": "numeric",
        "index": "37",
        "is_ignore": "false",
        "is_row_identifier": "false",
        "is_target": "false",
        "name": "nH",
        "number_of_missing_values": "0"
      },
      {
        "data_type": "numeric",
        "index": "38",
        "is_ignore": "false",
        "is_row_identifier": "false",
        "is_target": "false",
        "name": "H.052",
        "number_of_missing_values": "0"
      },
      {
        "data_type": "numeric",
        "index": "39",
        "is_ignore": "false",
        "is_row_identifier": "false",
        "is_target": "false",
        "name": "ATSC2m",
        "number_of_missing_values": "0"
      },
      {
        "data_type": "numeric",
        "index": "40",
        "is_ignore": "false",
        "is_row_identifier": "false",
        "is_target": "false",
        "name": "CATS2D_04_DD",
        "number_of_missing_values": "0"
      },
      {
        "data_type": "numeric",
        "index": "41",
        "is_ignore": "false",
        "is_row_identifier": "false",
        "is_target": "false",
        "name": "RBN",
        "number_of_missing_values": "0"
      },
      {
        "data_type": "numeric",
        "index": "42",
        "is_ignore": "false",
        "is_row_identifier": "false",
        "is_target": "false",
        "name": "ATSC1v",
        "number_of_missing_values": "0"
      },
      {
        "data_type": "numeric",
        "index": "43",
        "is_ignore": "false",
        "is_row_identifier": "false",
        "is_target": "false",
        "name": "JGI5",
        "number_of_missing_values": "0"
      },
      {
        "data_type": "numeric",
        "index": "44",
        "is_ignore": "false",
        "is_row_identifier": "false",
        "is_target": "false",
        "name": "CATS2D_09_DP",
        "number_of_missing_values": "0"
      },
      {
        "data_type": "numeric",
        "index": "45",
        "is_ignore": "false",
        "is_row_identifier": "false",
        "is_target": "false",
        "name": "ATSC5v",
        "number_of_missing_values": "0"
      },
      {
        "data_type": "numeric",
        "index": "46",
        "is_ignore": "false",
        "is_row_identifier": "false",
        "is_target": "false",
        "name": "Cl.089",
        "number_of_missing_values": "0"
      },
      {
        "data_type": "numeric",
        "index": "47",
        "is_ignore": "false",
        "is_row_identifier": "false",
        "is_target": "false",
        "name": "ATSC6m",
        "number_of_missing_values": "0"
      },
      {
        "data_type": "numeric",
        "index": "48",
        "is_ignore": "false",
        "is_row_identifier": "false",
        "is_target": "false",
        "name": "nCsp3",
        "number_of_missing_values": "0"
      },
      {
        "data_type": "numeric",
        "index": "49",
        "is_ignore": "false",
        "is_row_identifier": "false",
        "is_target": "false",
        "name": "nRNHO",
        "number_of_missing_values": "0"
      },
      {
        "data_type": "numeric",
        "index": "50",
        "is_ignore": "false",
        "is_row_identifier": "false",
        "is_target": "false",
        "name": "O.056",
        "number_of_missing_values": "0"
      },
      {
        "data_type": "numeric",
        "index": "51",
        "is_ignore": "false",
        "is_row_identifier": "false",
        "is_target": "false",
        "name": "MATS1i",
        "number_of_missing_values": "0"
      },
      {
        "data_type": "numeric",
        "index": "52",
        "is_ignore": "false",
        "is_row_identifier": "false",
        "is_target": "false",
        "name": "ATSC7v",
        "number_of_missing_values": "0"
      },
      {
        "data_type": "numeric",
        "index": "53",
        "is_ignore": "false",
        "is_row_identifier": "false",
        "is_target": "false",
        "name": "MATS2v",
        "number_of_missing_values": "0"
      },
      {
        "data_type": "numeric",
        "index": "54",
        "is_ignore": "false",
        "is_row_identifier": "false",
        "is_target": "false",
        "name": "nCL",
        "number_of_missing_values": "0"
      },
      {
        "data_type": "numeric",
        "index": "55",
        "is_ignore": "false",
        "is_row_identifier": "false",
        "is_target": "false",
        "name": "NsCl",
        "number_of_missing_values": "0"
      },
      {
        "data_type": "numeric",
        "index": "56",
        "is_ignore": "false",
        "is_row_identifier": "false",
        "is_target": "false",
        "name": "P_VSA_e_4",
        "number_of_missing_values": "0"
      },
      {
        "data_type": "numeric",
        "index": "57",
        "is_ignore": "false",
        "is_row_identifier": "false",
        "is_target": "false",
        "name": "P_VSA_m_4",
        "number_of_missing_values": "0"
      },
      {
        "data_type": "numeric",
        "index": "58",
        "is_ignore": "false",
        "is_row_identifier": "false",
        "is_target": "false",
        "name": "DLS_03",
        "number_of_missing_values": "0"
      },
      {
        "data_type": "numeric",
        "index": "59",
        "is_ignore": "false",
        "is_row_identifier": "false",
        "is_target": "false",
        "name": "nN",
        "number_of_missing_values": "0"
      },
      {
        "data_type": "numeric",
        "index": "60",
        "is_ignore": "false",
        "is_row_identifier": "false",
        "is_target": "false",
        "name": "BLTA96",
        "number_of_missing_values": "0"
      },
      {
        "data_type": "numeric",
        "index": "61",
        "is_ignore": "false",
        "is_row_identifier": "false",
        "is_target": "false",
        "name": "BLTD48",
        "number_of_missing_values": "0"
      },
      {
        "data_type": "numeric",
        "index": "62",
        "is_ignore": "false",
        "is_row_identifier": "false",
        "is_target": "false",
        "name": "BLTF96",
        "number_of_missing_values": "0"
      },
      {
        "data_type": "numeric",
        "index": "63",
        "is_ignore": "false",
        "is_row_identifier": "false",
        "is_target": "false",
        "name": "MLOGP",
        "number_of_missing_values": "0"
      },
      {
        "data_type": "numeric",
        "index": "64",
        "is_ignore": "false",
        "is_row_identifier": "false",
        "is_target": "false",
        "name": "X2A",
        "number_of_missing_values": "0"
      },
      {
        "data_type": "numeric",
        "index": "65",
        "is_ignore": "false",
        "is_row_identifier": "false",
        "is_target": "false",
        "name": "ATSC6v",
        "number_of_missing_values": "0"
      },
      {
        "data_type": "numeric",
        "index": "66",
        "is_ignore": "false",
        "is_row_identifier": "false",
        "is_target": "false",
        "name": "nROH",
        "number_of_missing_values": "0"
      },
      {
        "data_type": "numeric",
        "index": "67",
        "is_ignore": "false",
        "is_row_identifier": "false",
        "is_target": "false",
        "name": "SpMin4_Bh.m.",
        "number_of_missing_values": "0"
      },
      {
        "data_type": "numeric",
        "index": "68",
        "is_ignore": "false",
        "is_row_identifier": "false",
        "is_target": "false",
        "name": "Eig15_EA.dm.",
        "number_of_missing_values": "0"
      },
      {
        "data_type": "numeric",
        "index": "69",
        "is_ignore": "false",
        "is_row_identifier": "false",
        "is_target": "false",
        "name": "CATS2D_01_DA",
        "number_of_missing_values": "0"
      },
      {
        "data_type": "numeric",
        "index": "70",
        "is_ignore": "false",
        "is_row_identifier": "false",
        "is_target": "false",
        "name": "CATS2D_03_DL",
        "number_of_missing_values": "0"
      },
      {
        "data_type": "numeric",
        "index": "71",
        "is_ignore": "false",
        "is_row_identifier": "false",
        "is_target": "false",
        "name": "X1A",
        "number_of_missing_values": "0"
      },
      {
        "data_type": "numeric",
        "index": "72",
        "is_ignore": "false",
        "is_row_identifier": "false",
        "is_target": "false",
        "name": "CATS2D_09_DA",
        "number_of_missing_values": "0"
      },
      {
        "data_type": "numeric",
        "index": "73",
        "is_ignore": "false",
        "is_row_identifier": "false",
        "is_target": "false",
        "name": "ATSC8e",
        "number_of_missing_values": "0"
      },
      {
        "data_type": "numeric",
        "index": "74",
        "is_ignore": "false",
        "is_row_identifier": "false",
        "is_target": "false",
        "name": "SpMin3_Bh.s.",
        "number_of_missing_values": "0"
      },
      {
        "data_type": "numeric",
        "index": "75",
        "is_ignore": "false",
        "is_row_identifier": "false",
        "is_target": "false",
        "name": "P_VSA_e_1",
        "number_of_missing_values": "0"
      },
      {
        "data_type": "numeric",
        "index": "76",
        "is_ignore": "false",
        "is_row_identifier": "false",
        "is_target": "false",
        "name": "P_VSA_m_1",
        "number_of_missing_values": "0"
      },
      {
        "data_type": "numeric",
        "index": "77",
        "is_ignore": "false",
        "is_row_identifier": "false",
        "is_target": "false",
        "name": "P_VSA_s_2",
        "number_of_missing_values": "0"
      },
      {
        "data_type": "numeric",
        "index": "78",
        "is_ignore": "false",
        "is_row_identifier": "false",
        "is_target": "false",
        "name": "P_VSA_v_1",
        "number_of_missing_values": "0"
      },
      {
        "data_type": "numeric",
        "index": "79",
        "is_ignore": "false",
        "is_row_identifier": "false",
        "is_target": "false",
        "name": "GGI10",
        "number_of_missing_values": "0"
      },
      {
        "data_type": "numeric",
        "index": "80",
        "is_ignore": "false",
        "is_row_identifier": "false",
        "is_target": "false",
        "name": "P_VSA_LogP_7",
        "number_of_missing_values": "0"
      },
      {
        "data_type": "numeric",
        "index": "81",
        "is_ignore": "false",
        "is_row_identifier": "false",
        "is_target": "false",
        "name": "MATS1p",
        "number_of_missing_values": "0"
      },
      {
        "data_type": "numeric",
        "index": "82",
        "is_ignore": "false",
        "is_row_identifier": "false",
        "is_target": "false",
        "name": "CATS2D_05_AA",
        "number_of_missing_values": "0"
      },
      {
        "data_type": "numeric",
        "index": "83",
        "is_ignore": "false",
        "is_row_identifier": "false",
        "is_target": "false",
        "name": "Eig11_AEA.ed.",
        "number_of_missing_values": "0"
      },
      {
        "data_type": "numeric",
        "index": "84",
        "is_ignore": "false",
        "is_row_identifier": "false",
        "is_target": "false",
        "name": "SpMin1_Bh.e.",
        "number_of_missing_values": "0"
      },
      {
        "data_type": "numeric",
        "index": "85",
        "is_ignore": "false",
        "is_row_identifier": "false",
        "is_target": "false",
        "name": "C.040",
        "number_of_missing_values": "0"
      },
      {
        "data_type": "numeric",
        "index": "86",
        "is_ignore": "false",
        "is_row_identifier": "false",
        "is_target": "false",
        "name": "Eig07_EA.dm.",
        "number_of_missing_values": "0"
      },
      {
        "data_type": "numeric",
        "index": "87",
        "is_ignore": "false",
        "is_row_identifier": "false",
        "is_target": "false",
        "name": "Eig09_EA.dm.",
        "number_of_missing_values": "0"
      },
      {
        "data_type": "numeric",
        "index": "88",
        "is_ignore": "false",
        "is_row_identifier": "false",
        "is_target": "false",
        "name": "Eig11_EA.dm.",
        "number_of_missing_values": "0"
      },
      {
        "data_type": "numeric",
        "index": "89",
        "is_ignore": "false",
        "is_row_identifier": "false",
        "is_target": "false",
        "name": "P_VSA_i_4",
        "number_of_missing_values": "0"
      },
      {
        "data_type": "numeric",
        "index": "90",
        "is_ignore": "false",
        "is_row_identifier": "false",
        "is_target": "false",
        "name": "ATS4i",
        "number_of_missing_values": "0"
      },
      {
        "data_type": "numeric",
        "index": "91",
        "is_ignore": "false",
        "is_row_identifier": "false",
        "is_target": "false",
        "name": "Eig07_EA.ri.",
        "number_of_missing_values": "0"
      },
      {
        "data_type": "numeric",
        "index": "92",
        "is_ignore": "false",
        "is_row_identifier": "false",
        "is_target": "false",
        "name": "CATS2D_08_AP",
        "number_of_missing_values": "0"
      },
      {
        "data_type": "numeric",
        "index": "93",
        "is_ignore": "false",
        "is_row_identifier": "false",
        "is_target": "false",
        "name": "ATS5e",
        "number_of_missing_values": "0"
      },
      {
        "data_type": "numeric",
        "index": "94",
        "is_ignore": "false",
        "is_row_identifier": "false",
        "is_target": "false",
        "name": "TIC5",
        "number_of_missing_values": "0"
      },
      {
        "data_type": "numeric",
        "index": "95",
        "is_ignore": "false",
        "is_row_identifier": "false",
        "is_target": "false",
        "name": "SpMin1_Bh.i.",
        "number_of_missing_values": "0"
      },
      {
        "data_type": "numeric",
        "index": "96",
        "is_ignore": "false",
        "is_row_identifier": "false",
        "is_target": "false",
        "name": "ATS3i",
        "number_of_missing_values": "0"
      },
      {
        "data_type": "numeric",
        "index": "97",
        "is_ignore": "false",
        "is_row_identifier": "false",
        "is_target": "false",
        "name": "nRCONHR",
        "number_of_missing_values": "0"
      },
      {
        "data_type": "numeric",
        "index": "98",
        "is_ignore": "false",
        "is_row_identifier": "false",
        "is_target": "false",
        "name": "ATS3v",
        "number_of_missing_values": "0"
      },
      {
        "data_type": "numeric",
        "index": "99",
        "is_ignore": "false",
        "is_row_identifier": "false",
        "is_target": "false",
        "name": "Eig05_EA.dm.",
        "number_of_missing_values": "0"
      },
      {
        "data_type": "numeric",
        "index": "100",
        "is_ignore": "false",
        "is_row_identifier": "false",
        "is_target": "false",
        "name": "CATS2D_02_DP",
        "number_of_missing_values": "0"
      },
      {
        "data_type": "numeric",
        "index": "101",
        "is_ignore": "false",
        "is_row_identifier": "false",
        "is_target": "false",
        "name": "Ram",
        "number_of_missing_values": "0"
      },
      {
        "data_type": "numeric",
        "index": "102",
        "is_ignore": "false",
        "is_row_identifier": "false",
        "is_target": "false",
        "name": "P_VSA_m_2",
        "number_of_missing_values": "0"
      },
      {
        "data_type": "numeric",
        "index": "103",
        "is_ignore": "false",
        "is_row_identifier": "false",
        "is_target": "false",
        "name": "ATS4v",
        "number_of_missing_values": "0"
      },
      {
        "data_type": "numeric",
        "index": "104",
        "is_ignore": "false",
        "is_row_identifier": "false",
        "is_target": "false",
        "name": "CATS2D_02_LL",
        "number_of_missing_values": "0"
      },
      {
        "data_type": "numeric",
        "index": "105",
        "is_ignore": "false",
        "is_row_identifier": "false",
        "is_target": "false",
        "name": "Eig01_EA.bo.",
        "number_of_missing_values": "0"
      },
      {
        "data_type": "numeric",
        "index": "106",
        "is_ignore": "false",
        "is_row_identifier": "false",
        "is_target": "false",
        "name": "SM11_AEA.ri.",
        "number_of_missing_values": "0"
      },
      {
        "data_type": "numeric",
        "index": "107",
        "is_ignore": "false",
        "is_row_identifier": "false",
        "is_target": "false",
        "name": "SpDiam_EA.bo.",
        "number_of_missing_values": "0"
      },
      {
        "data_type": "numeric",
        "index": "108",
        "is_ignore": "false",
        "is_row_identifier": "false",
        "is_target": "false",
        "name": "SpMax_EA.bo.",
        "number_of_missing_values": "0"
      },
      {
        "data_type": "numeric",
        "index": "109",
        "is_ignore": "false",
        "is_row_identifier": "false",
        "is_target": "false",
        "name": "Eig06_EA.dm.",
        "number_of_missing_values": "0"
      },
      {
        "data_type": "numeric",
        "index": "110",
        "is_ignore": "false",
        "is_row_identifier": "false",
        "is_target": "false",
        "name": "Eig10_EA.dm.",
        "number_of_missing_values": "0"
      },
      {
        "data_type": "numeric",
        "index": "111",
        "is_ignore": "false",
        "is_row_identifier": "false",
        "is_target": "false",
        "name": "ATS5i",
        "number_of_missing_values": "0"
      },
      {
        "data_type": "numeric",
        "index": "112",
        "is_ignore": "false",
        "is_row_identifier": "false",
        "is_target": "false",
        "name": "MATS5e",
        "number_of_missing_values": "0"
      },
      {
        "data_type": "numeric",
        "index": "113",
        "is_ignore": "false",
        "is_row_identifier": "false",
        "is_target": "false",
        "name": "Eig01_AEA.ed.",
        "number_of_missing_values": "0"
      },
      {
        "data_type": "numeric",
        "index": "114",
        "is_ignore": "false",
        "is_row_identifier": "false",
        "is_target": "false",
        "name": "SpMax_AEA.ed.",
        "number_of_missing_values": "0"
      },
      {
        "data_type": "numeric",
        "index": "115",
        "is_ignore": "false",
        "is_row_identifier": "false",
        "is_target": "false",
        "name": "SM03_EA.ri.",
        "number_of_missing_values": "0"
      },
      {
        "data_type": "numeric",
        "index": "116",
        "is_ignore": "false",
        "is_row_identifier": "false",
        "is_target": "false",
        "name": "DLS_07",
        "number_of_missing_values": "0"
      },
      {
        "data_type": "numeric",
        "index": "117",
        "is_ignore": "false",
        "is_row_identifier": "false",
        "is_target": "false",
        "name": "VvdwZAZ",
        "number_of_missing_values": "0"
      },
      {
        "data_type": "numeric",
        "index": "118",
        "is_ignore": "false",
        "is_row_identifier": "false",
        "is_target": "false",
        "name": "ATS3p",
        "number_of_missing_values": "0"
      },
      {
        "data_type": "numeric",
        "index": "119",
        "is_ignore": "false",
        "is_row_identifier": "false",
        "is_target": "false",
        "name": "X5A",
        "number_of_missing_values": "0"
      },
      {
        "data_type": "numeric",
        "index": "120",
        "is_ignore": "false",
        "is_row_identifier": "false",
        "is_target": "false",
        "name": "SsCl",
        "number_of_missing_values": "0"
      },
      {
        "data_type": "numeric",
        "index": "121",
        "is_ignore": "false",
        "is_row_identifier": "false",
        "is_target": "false",
        "name": "ATS6e",
        "number_of_missing_values": "0"
      },
      {
        "data_type": "numeric",
        "index": "122",
        "is_ignore": "false",
        "is_row_identifier": "false",
        "is_target": "false",
        "name": "Eig08_EA.dm.",
        "number_of_missing_values": "0"
      },
      {
        "data_type": "numeric",
        "index": "123",
        "is_ignore": "false",
        "is_row_identifier": "false",
        "is_target": "false",
        "name": "ATSC3e",
        "number_of_missing_values": "0"
      },
      {
        "data_type": "numeric",
        "index": "124",
        "is_ignore": "false",
        "is_row_identifier": "false",
        "is_target": "false",
        "name": "ATS1p",
        "number_of_missing_values": "0"
      },
      {
        "data_type": "numeric",
        "index": "125",
        "is_ignore": "false",
        "is_row_identifier": "false",
        "is_target": "false",
        "name": "MATS1v",
        "number_of_missing_values": "0"
      },
      {
        "data_type": "numeric",
        "index": "126",
        "is_ignore": "false",
        "is_row_identifier": "false",
        "is_target": "false",
        "name": "ATS7e",
        "number_of_missing_values": "0"
      },
      {
        "data_type": "numeric",
        "index": "127",
        "is_ignore": "false",
        "is_row_identifier": "false",
        "is_target": "false",
        "name": "X3sol",
        "number_of_missing_values": "0"
      },
      {
        "data_type": "numeric",
        "index": "128",
        "is_ignore": "false",
        "is_row_identifier": "false",
        "is_target": "false",
        "name": "ATS8e",
        "number_of_missing_values": "0"
      },
      {
        "data_type": "numeric",
        "index": "129",
        "is_ignore": "false",
        "is_row_identifier": "false",
        "is_target": "false",
        "name": "Eig15_AEA.ri.",
        "number_of_missing_values": "0"
      },
      {
        "data_type": "numeric",
        "index": "130",
        "is_ignore": "false",
        "is_row_identifier": "false",
        "is_target": "false",
        "name": "ATS5v",
        "number_of_missing_values": "0"
      },
      {
        "data_type": "numeric",
        "index": "131",
        "is_ignore": "false",
        "is_row_identifier": "false",
        "is_target": "false",
        "name": "Eig05_AEA.dm.",
        "number_of_missing_values": "0"
      },
      {
        "data_type": "numeric",
        "index": "132",
        "is_ignore": "false",
        "is_row_identifier": "false",
        "is_target": "false",
        "name": "IC5",
        "number_of_missing_values": "0"
      },
      {
        "data_type": "numeric",
        "index": "133",
        "is_ignore": "false",
        "is_row_identifier": "false",
        "is_target": "false",
        "name": "SpMax4_Bh.s.",
        "number_of_missing_values": "0"
      },
      {
        "data_type": "numeric",
        "index": "134",
        "is_ignore": "false",
        "is_row_identifier": "false",
        "is_target": "false",
        "name": "X4A",
        "number_of_missing_values": "0"
      },
      {
        "data_type": "numeric",
        "index": "135",
        "is_ignore": "false",
        "is_row_identifier": "false",
        "is_target": "false",
        "name": "X3A",
        "number_of_missing_values": "0"
      },
      {
        "data_type": "numeric",
        "index": "136",
        "is_ignore": "false",
        "is_row_identifier": "false",
        "is_target": "false",
        "name": "X0",
        "number_of_missing_values": "0"
      },
      {
        "data_type": "numeric",
        "index": "137",
        "is_ignore": "false",
        "is_row_identifier": "false",
        "is_target": "true",
        "name": "pXC50",
        "number_of_missing_values": "0"
      }
    ]
  }
}