"molecule_id","AMW","C.","pXC50"
{1 8.778,2 48.8,3 5}
{0 CHEMBL101253,1 8.671,2 50,3 5}
{0 CHEMBL103667,1 6.944,2 40.8,3 5}
{0 CHEMBL105442,1 12.274,2 43.6,3 5}
{0 CHEMBL1090089,1 8.294,2 38.8,3 6.824}
{0 CHEMBL1173655,1 8.237,2 40.7,3 5}
{0 CHEMBL119385,1 11.791,2 51.4,3 5}
{0 CHEMBL1230020,1 10.094,2 41.5,3 5}
{0 CHEMBL1230122,1 8.444,2 41.3,3 7.137}
{0 CHEMBL1236107,1 9.217,2 46.2,3 5}
{0 CHEMBL1240703,1 7.928,2 47.3,3 5}
{0 CHEMBL1241674,1 7.907,2 41,3 5}
{0 CHEMBL124660,1 6.781,2 37.3,3 5}
{0 CHEMBL1287853,1 7.188,2 37,3 5}
{0 CHEMBL1289926,1 8.402,2 47.8,3 5}
{0 CHEMBL1336,1 9.685,2 43.8,3 5}
{0 CHEMBL1421,1 8.272,2 37.3,3 5}
{0 CHEMBL14762,1 6.817,2 36.5,3 5}
{0 CHEMBL1614701,1 10.898,2 40.5,3 5}
{0 CHEMBL162,1 7.649,2 45.9,3 5.658}
{0 CHEMBL1721885,1 7.501,2 39,3 5.699}
{0 CHEMBL1789941,1 7.473,2 41.5,3 5}
{0 CHEMBL180022,1 8.074,2 43.5,3 5}
{0 CHEMBL1908391,1 7.556,2 42.4,3 5}
{0 CHEMBL1908392,1 7.189,2 43.3,3 5}
{0 CHEMBL1908393,1 7.741,2 41.5,3 5}
{0 CHEMBL1908394,1 8.237,2 40.9,3 5}
{0 CHEMBL1908395,1 6.979,2 39.4,3 5.248}
{0 CHEMBL1908396,1 8.286,2 41.4,3 5}
{0 CHEMBL1908397,1 7.388,2 44.4,3 5.809}
{0 CHEMBL191003,1 10.113,2 38.5,3 5.262}
{0 CHEMBL1929238,1 8.038,2 36.2,3 4.523}
{0 CHEMBL1964687,1 8.148,2 45.1,3 7}
{0 CHEMBL1969755,1 7.787,2 46.7,3 5.8}
{0 CHEMBL1973145,1 8.489,2 43.5,3 5.8}
{0 CHEMBL1973211,1 7.769,2 45.2,3 6.6}
{0 CHEMBL1973937,1 9.486,2 45.7,3 6.7}
{0 CHEMBL1975233,1 9.346,2 41.2,3 5.8}
{0 CHEMBL1979883,1 7.856,2 44.8,3 6.7}
{0 CHEMBL1987679,1 8.009,2 46,3 7.7}
{0 CHEMBL1990885,1 7.117,2 39.3,3 7.2}
{0 CHEMBL1991143,1 8.942,2 47.4,3 5.9}
{0 CHEMBL1991285,1 8.598,2 40,3 5.8}
{0 CHEMBL1992306,1 8.967,2 43.8,3 5.8}
{0 CHEMBL1998545,1 7.387,2 46.7,3 6.2}
{0 CHEMBL1998585,1 10.169,2 45.5,3 7.1}
{0 CHEMBL2001224,1 8.451,2 40.9,3 5.8}
{0 CHEMBL2001257,1 7.558,2 43.8,3 6.9}
{0 CHEMBL2002726,1 7.316,2 44.9,3 7.4}
{0 CHEMBL2004447,1 7.809,2 42.5,3 5.8}
{0 CHEMBL2006493,1 9.732,2 48.3,3 5.8}
{0 CHEMBL210887,1 8.302,2 41.5,3 5.8}
{0 CHEMBL215152,1 7.577,2 38.8,3 5}
{0 CHEMBL220057,1 7.771,2 45.7,3 7}
{0 CHEMBL2205766,1 8.249,2 35.7,3 5}
{0 CHEMBL221959,1 7.266,2 37.2,3 5}
{0 CHEMBL223360,1 8.162,2 45.7,3 5.072}
{0 CHEMBL225519,1 7.899,2 44.4,3 5.521}
{0 CHEMBL226471,1 8.307,2 48.6,3 4.237}
{0 CHEMBL230011,1 8.659,2 45,3 5}
{0 CHEMBL2309006,1 8.139,2 48.1,3 5.443}
{0 CHEMBL2309609,1 7.818,2 47.9,3 6.373}
{0 CHEMBL24828,1 8.804,2 40.7,3 5}
{0 CHEMBL248757,1 9.439,2 40,3 6.023}
{0 CHEMBL249697,1 7.093,2 38.9,3 5.319}
{0 CHEMBL253969,1 9.508,2 35.7,3 5.8}
{0 CHEMBL255863,1 8.681,2 45.9,3 5}
{0 CHEMBL259084,1 9.732,2 51,3 5}
{0 CHEMBL261849,1 7.479,2 40.8,3 5}
{0 CHEMBL271381,1 9.855,2 45.7,3 6.8}
{0 CHEMBL278041,1 8.497,2 51.3,3 5}
{0 CHEMBL288441,1 8.162,2 40,3 5}
{0 CHEMBL296468,1 7.767,2 34.7,3 5}
{0 CHEMBL300138,1 7.583,2 47.1,3 5.301}
{0 CHEMBL31965,1 8.237,2 40.7,3 5}
{0 CHEMBL340921,1 8.254,2 48.9,3 6.1}
{0 CHEMBL377300,1 8.053,2 41.3,3 5}
{0 CHEMBL379218,1 7.316,2 44.9,3 5.248}
{0 CHEMBL384304,1 8.657,2 35.3,3 5}
{0 CHEMBL386051,1 9.853,2 46.7,3 5}
{0 CHEMBL387971,1 7.688,2 41.9,3 5.8}
{0 CHEMBL394619,1 8.322,2 46.7,3 6.8}
{0 CHEMBL402846,1 8.135,2 43.8,3 5.8}
{0 CHEMBL404367,1 7.76,2 43.8,3 6.6}
{0 CHEMBL428690,1 8.372,2 43.8,3 5.443}
{0 CHEMBL440084,1 8.543,2 48.9,3 5}
{0 CHEMBL445813,1 9.102,2 38.1,3 5}
{0 CHEMBL450786,1 8.333,2 41.6,3 5}
{0 CHEMBL464552,1 7.833,2 39.7,3 5}
{0 CHEMBL475251,1 8.255,2 38.6,3 5}
{0 CHEMBL477772,1 8.103,2 38.9,3 5}
{0 CHEMBL483321,1 7.574,2 43.5,3 5}
{0 CHEMBL491473,1 7.509,2 41.7,3 5}
{0 CHEMBL494089,1 7.337,2 36.2,3 5}
{0 CHEMBL495727,1 7.48,2 37.3,3 8}
{0 CHEMBL509032,1 7.491,2 36.6,3 5.301}
{0 CHEMBL513909,1 6.776,2 36.4,3 5}
{0 CHEMBL514409,1 7.489,2 42,3 7.027}
{0 CHEMBL521851,1 8.286,2 37.1,3 5}
{0 CHEMBL522892,1 7.85,2 42,3 5}
{0 CHEMBL525191,1 7.777,2 44.2,3 5}
{0 CHEMBL535,1 7.117,2 39.3,3 5.5}
{0 CHEMBL553,1 7.567,2 42.3,3 5.078}
{0 CHEMBL554,1 8.805,2 43.9,3 5}
{0 CHEMBL558752,1 9.782,2 45.3,3 5}
{0 CHEMBL572878,1 7.617,2 37.7,3 5}
{0 CHEMBL572881,1 7.324,2 43.1,3 5}
{0 CHEMBL573339,1 8.295,2 45.2,3 5}
{0 CHEMBL574738,1 7.789,2 38.2,3 5.361}
{0 CHEMBL576982,1 7.788,2 40.3,3 5}
{0 CHEMBL601719,1 8.661,2 40.4,3 5}
{0 CHEMBL607707,1 8.357,2 42.9,3 5}
{0 CHEMBL608154,1 8.947,2 46.3,3 5}
{0 CHEMBL91829,1 7.438,2 44.4,3 5.108}
{0 CHEMBL939,1 8.126,2 40,3 5.4}
{0 CHEMBL941,1 7.26,2 42.6,3 5}
