{
  "data_features": {
    "feature": [
      {
        "data_type": "nominal",
        "index": "0",
        "is_ignore": "false",
        "is_row_identifier": "true",
        "is_target": "false",
        "name": "molecule_id",
        "nominal_value": [
          "CHEMBL111",
          "CHEMBL112486",
          "CHEMBL113262",
          "CHEMBL120473",
          "CHEMBL120788",
          "CHEMBL120889",
          "CHEMBL120935",
          "CHEMBL120944",
          "CHEMBL121011",
          "CHEMBL1210154",
          "CHEMBL121073",
          "CHEMBL121203",
          "CHEMBL121258",
          "CHEMBL121490",
          "CHEMBL121681",
          "CHEMBL151167",
          "CHEMBL15848",
          "CHEMBL188",
          "CHEMBL1923761",
          "CHEMBL1923763",
          "CHEMBL1950351",
          "CHEMBL214229",
          "CHEMBL214511",
          "CHEMBL216057",
          "CHEMBL216067",
          "CHEMBL216276",
          "CHEMBL216333",
          "CHEMBL216335",
          "CHEMBL216382",
          "CHEMBL216438",
          "CHEMBL216555",
          "CHEMBL216595",
          "CHEMBL216659",
          "CHEMBL216690",
          "CHEMBL216735",
          "CHEMBL216888",
          "CHEMBL217094",
          "CHEMBL217247",
          "CHEMBL217266",
          "CHEMBL217549",
          "CHEMBL217583",
          "CHEMBL218295",
          "CHEMBL218432",
          "CHEMBL218571",
          "CHEMBL218957",
          "CHEMBL219037",
          "CHEMBL219578",
          "CHEMBL224053",
          "CHEMBL224114",
          "CHEMBL224847",
          "CHEMBL225377",
          "CHEMBL225415",
          "CHEMBL225622",
          "CHEMBL232116",
          "CHEMBL232129",
          "CHEMBL232328",
          "CHEMBL232730",
          "CHEMBL2337202",
          "CHEMBL2337203",
          "CHEMBL2337204",
          "CHEMBL2337205",
          "CHEMBL2337206",
          "CHEMBL2338174",
          "CHEMBL2338175",
          "CHEMBL2338176",
          "CHEMBL2338177",
          "CHEMBL2338178",
          "CHEMBL2338179",
          "CHEMBL2338181",
          "CHEMBL2338182",
          "CHEMBL2338183",
          "CHEMBL2338184",
          "CHEMBL2338185",
          "CHEMBL2338186",
          "CHEMBL2338187",
          "CHEMBL2338188",
          "CHEMBL2346668",
          "CHEMBL2346977",
          "CHEMBL2346978",
          "CHEMBL2346979",
          "CHEMBL2346980",
          "CHEMBL2346981",
          "CHEMBL238082",
          "CHEMBL238083",
          "CHEMBL23838",
          "CHEMBL239257",
          "CHEMBL240109",
          "CHEMBL240324",
          "CHEMBL240697",
          "CHEMBL240913",
          "CHEMBL241567",
          "CHEMBL241774",
          "CHEMBL246952",
          "CHEMBL248135",
          "CHEMBL272203",
          "CHEMBL309042",
          "CHEMBL320106",
          "CHEMBL331420",
          "CHEMBL332064",
          "CHEMBL333149",
          "CHEMBL333514",
          "CHEMBL364266",
          "CHEMBL371214",
          "CHEMBL374889",
          "CHEMBL381689",
          "CHEMBL384595",
          "CHEMBL385057",
          "CHEMBL385151",
          "CHEMBL385268",
          "CHEMBL385508",
          "CHEMBL385808",
          "CHEMBL386014",
          "CHEMBL386489",
          "CHEMBL386644",
          "CHEMBL386725",
          "CHEMBL386832",
          "CHEMBL386858",
          "CHEMBL387001",
          "CHEMBL387112",
          "CHEMBL389203",
          "CHEMBL389669",
          "CHEMBL389693",
          "CHEMBL391430",
          "CHEMBL391839",
          "CHEMBL393324",
          "CHEMBL409150",
          "CHEMBL410727",
          "CHEMBL414366",
          "CHEMBL443842",
          "CHEMBL444970",
          "CHEMBL462582",
          "CHEMBL462609",
          "CHEMBL462610",
          "CHEMBL463656",
          "CHEMBL464679",
          "CHEMBL465",
          "CHEMBL475904",
          "CHEMBL482356",
          "CHEMBL485369",
          "CHEMBL494211",
          "CHEMBL499569",
          "CHEMBL512224",
          "CHEMBL514909",
          "CHEMBL517157",
          "CHEMBL541216",
          "CHEMBL559612",
          "CHEMBL97038"
        ],
        "number_of_missing_values": "0"
      },
      {
        "data_type": "numeric",
        "index": "1",
        "is_ignore": "false",
        "is_row_identifier": "false",
        "is_target": "false",
        "name": "AMW",
        "number_of_missing_values": "0"
      },
      {
        "data_type": "numeric",
        "index": "2",
        "is_ignore": "false",
        "is_row_identifier": "false",
        "is_target": "false",
        "name": "C.",
        "number_of_missing_values": "0"
      },
      {
        "data_type": "numeric",
        "index": "3",
        "is_ignore": "false",
        "is_row_identifier": "false",
        "is_target": "false",
        "name": "H.",
        "number_of_missing_values": "0"
      },
      {
        "data_type": "numeric",
        "index": "4",
        "is_ignore": "false",
        "is_row_identifier": "false",
        "is_target": "false",
        "name": "Me",
        "number_of_missing_values": "0"
      },
      {
        "data_type": "numeric",
        "index": "5",
        "is_ignore": "false",
        "is_row_identifier": "false",
        "is_target": "false",
        "name": "Mi",
        "number_of_missing_values": "0"
      },
      {
        "data_type": "numeric",
        "index": "6",
        "is_ignore": "false",
        "is_row_identifier": "false",
        "is_target": "false",
        "name": "Mp",
        "number_of_missing_values": "0"
      },
      {
        "data_type": "numeric",
        "index": "7",
        "is_ignore": "false",
        "is_row_identifier": "false",
        "is_target": "false",
        "name": "Mv",
        "number_of_missing_values": "0"
      },
      {
        "data_type": "numeric",
        "index": "8",
        "is_ignore": "false",
        "is_row_identifier": "false",
        "is_target": "false",
        "name": "MW",
        "number_of_missing_values": "0"
      },
      {
        "data_type": "numeric",
        "index": "9",
        "is_ignore": "false",
        "is_row_identifier": "false",
        "is_target": "false",
        "name": "N.",
        "number_of_missing_values": "0"
      },
      {
        "data_type": "numeric",
        "index": "10",
        "is_ignore": "false",
        "is_row_identifier": "false",
        "is_target": "false",
        "name": "nAB",
        "number_of_missing_values": "0"
      },
      {
        "data_type": "numeric",
        "index": "11",
        "is_ignore": "false",
        "is_row_identifier": "false",
        "is_target": "false",
        "name": "nAT",
        "number_of_missing_values": "0"
      },
      {
        "data_type": "numeric",
        "index": "12",
        "is_ignore": "false",
        "is_row_identifier": "false",
        "is_target": "false",
        "name": "nB",
        "number_of_missing_values": "0"
      },
      {
        "data_type": "numeric",
        "index": "13",
        "is_ignore": "false",
        "is_row_identifier": "false",
        "is_target": "false",
        "name": "nBM",
        "number_of_missing_values": "0"
      },
      {
        "data_type": "numeric",
        "index": "14",
        "is_ignore": "false",
        "is_row_identifier": "false",
        "is_target": "false",
        "name": "nBO",
        "number_of_missing_values": "0"
      },
      {
        "data_type": "numeric",
        "index": "15",
        "is_ignore": "false",
        "is_row_identifier": "false",
        "is_target": "false",
        "name": "nBR",
        "number_of_missing_values": "0"
      },
      {
        "data_type": "numeric",
        "index": "16",
        "is_ignore": "false",
        "is_row_identifier": "false",
        "is_target": "false",
        "name": "nBT",
        "number_of_missing_values": "0"
      },
      {
        "data_type": "numeric",
        "index": "17",
        "is_ignore": "false",
        "is_row_identifier": "false",
        "is_target": "false",
        "name": "nC",
        "number_of_missing_values": "0"
      },
      {
        "data_type": "numeric",
        "index": "18",
        "is_ignore": "false",
        "is_row_identifier": "false",
        "is_target": "false",
        "name": "nCL",
        "number_of_missing_values": "0"
      },
      {
        "data_type": "numeric",
        "index": "19",
        "is_ignore": "false",
        "is_row_identifier": "false",
        "is_target": "false",
        "name": "nCsp",
        "number_of_missing_values": "0"
      },
      {
        "data_type": "numeric",
        "index": "20",
        "is_ignore": "false",
        "is_row_identifier": "false",
        "is_target": "false",
        "name": "nCsp2",
        "number_of_missing_values": "0"
      },
      {
        "data_type": "numeric",
        "index": "21",
        "is_ignore": "false",
        "is_row_identifier": "false",
        "is_target": "false",
        "name": "nCsp3",
        "number_of_missing_values": "0"
      },
      {
        "data_type": "numeric",
        "index": "22",
        "is_ignore": "false",
        "is_row_identifier": "false",
        "is_target": "false",
        "name": "nDB",
        "number_of_missing_values": "0"
      },
      {
        "data_type": "numeric",
        "index": "23",
        "is_ignore": "false",
        "is_row_identifier": "false",
        "is_target": "false",
        "name": "nF",
        "number_of_missing_values": "0"
      },
      {
        "data_type": "numeric",
        "index": "24",
        "is_ignore": "false",
        "is_row_identifier": "false",
        "is_target": "false",
        "name": "nH",
        "number_of_missing_values": "0"
      },
      {
        "data_type": "numeric",
        "index": "25",
        "is_ignore": "false",
        "is_row_identifier": "false",
        "is_target": "false",
        "name": "nHet",
        "number_of_missing_values": "0"
      },
      {
        "data_type": "numeric",
        "index": "26",
        "is_ignore": "false",
        "is_row_identifier": "false",
        "is_target": "false",
        "name": "nHM",
        "number_of_missing_values": "0"
      },
      {
        "data_type": "numeric",
        "index": "27",
        "is_ignore": "false",
        "is_row_identifier": "false",
        "is_target": "false",
        "name": "nI",
        "number_of_missing_values": "0"
      },
      {
        "data_type": "numeric",
        "index": "28",
        "is_ignore": "false",
        "is_row_identifier": "false",
        "is_target": "false",
        "name": "nN",
        "number_of_missing_values": "0"
      },
      {
        "data_type": "numeric",
        "index": "29",
        "is_ignore": "false",
        "is_row_identifier": "false",
        "is_target": "false",
        "name": "nO",
        "number_of_missing_values": "0"
      },
      {
        "data_type": "numeric",
        "index": "30",
        "is_ignore": "false",
        "is_row_identifier": "false",
        "is_target": "false",
        "name": "nP",
        "number_of_missing_values": "0"
      },
      {
        "data_type": "numeric",
        "index": "31",
        "is_ignore": "false",
        "is_row_identifier": "false",
        "is_target": "false",
        "name": "nS",
        "number_of_missing_values": "0"
      },
      {
        "data_type": "numeric",
        "index": "32",
        "is_ignore": "false",
        "is_row_identifier": "false",
        "is_target": "false",
        "name": "nSK",
        "number_of_missing_values": "0"
      },
      {
        "data_type": "numeric",
        "index": "33",
        "is_ignore": "false",
        "is_row_identifier": "false",
        "is_target": "false",
        "name": "nTB",
        "number_of_missing_values": "0"
      },
      {
        "data_type": "numeric",
        "index": "34",
        "is_ignore": "false",
        "is_row_identifier": "false",
        "is_target": "false",
        "name": "nX",
        "number_of_missing_values": "0"
      },
      {
        "data_type": "numeric",
        "index": "35",
        "is_ignore": "false",
        "is_row_identifier": "false",
        "is_target": "false",
        "name": "O.",
        "number_of_missing_values": "0"
      },
      {
        "data_type": "numeric",
        "index": "36",
        "is_ignore": "false",
        "is_row_identifier": "false",
        "is_target": "false",
        "name": "RBF",
        "number_of_missing_values": "0"
      },
      {
        "data_type": "numeric",
        "index": "37",
        "is_ignore": "false",
        "is_row_identifier": "false",
        "is_target": "false",
        "name": "RBN",
        "number_of_missing_values": "0"
      },
      {
        "data_type": "numeric",
        "index": "38",
        "is_ignore": "false",
        "is_row_identifier": "false",
        "is_target": "false",
        "name": "SCBO",
        "number_of_missing_values": "0"
      },
      {
        "data_type": "numeric",
        "index": "39",
        "is_ignore": "false",
        "is_row_identifier": "false",
        "is_target": "false",
        "name": "Se",
        "number_of_missing_values": "0"
      },
      {
        "data_type": "numeric",
        "index": "40",
        "is_ignore": "false",
        "is_row_identifier": "false",
        "is_target": "false",
        "name": "Si",
        "number_of_missing_values": "0"
      },
      {
        "data_type": "numeric",
        "index": "41",
        "is_ignore": "false",
        "is_row_identifier": "false",
        "is_target": "false",
        "name": "Sp",
        "number_of_missing_values": "0"
      },
      {
        "data_type": "numeric",
        "index": "42",
        "is_ignore": "false",
        "is_row_identifier": "false",
        "is_target": "false",
        "name": "Sv",
        "number_of_missing_values": "0"
      },
      {
        "data_type": "numeric",
        "index": "43",
        "is_ignore": "false",
        "is_row_identifier": "false",
        "is_target": "false",
        "name": "X.",
        "number_of_missing_values": "0"
      },
      {
        "data_type": "numeric",
        "index": "44",
        "is_ignore": "false",
        "is_row_identifier": "false",
        "is_target": "true",
        "name": "pXC50",
        "number_of_missing_values": "0"
      }
    ]
  }
}