"molecule_id","FCFP4_1024b1","FCFP4_1024b10","FCFP4_1024b100","FCFP4_1024b1000","FCFP4_1024b1001","FCFP4_1024b1002","FCFP4_1024b1003","FCFP4_1024b1004","FCFP4_1024b1005","FCFP4_1024b1006","FCFP4_1024b1007","FCFP4_1024b1008","FCFP4_1024b1009","FCFP4_1024b101","FCFP4_1024b1010","FCFP4_1024b1011","FCFP4_1024b1012","FCFP4_1024b1013","FCFP4_1024b1014","FCFP4_1024b1015","FCFP4_1024b1016","FCFP4_1024b1017","FCFP4_1024b1018","FCFP4_1024b1019","FCFP4_1024b102","FCFP4_1024b1020","FCFP4_1024b1021","FCFP4_1024b1022","FCFP4_1024b1023","FCFP4_1024b1024","FCFP4_1024b103","FCFP4_1024b104","FCFP4_1024b105","FCFP4_1024b106","FCFP4_1024b107","FCFP4_1024b108","FCFP4_1024b109","FCFP4_1024b11","FCFP4_1024b110","FCFP4_1024b111","FCFP4_1024b112","FCFP4_1024b113","FCFP4_1024b114","FCFP4_1024b115","FCFP4_1024b116","FCFP4_1024b117","FCFP4_1024b118","FCFP4_1024b119","FCFP4_1024b12","FCFP4_1024b120","FCFP4_1024b121","pXC50"
{1 1,42 1,52 5.119}
{0 CHEMBL264778,1 1,42 1,52 4.509}
{0 CHEMBL265398,1 1,42 1,52 4.26}
{0 CHEMBL266022,1 1,42 1,52 3.764}
{0 CHEMBL266345,1 1,42 1,43 1,52 5.125}
{0 CHEMBL267349,1 1,42 1,52 4.086}
{0 CHEMBL269022,1 1,42 1,52 4.658}
{0 CHEMBL366979,1 1,42 1,44 1,52 4.569}
{0 CHEMBL384517,1 1,42 1,52 4.086}
{0 CHEMBL404823,1 1,42 1,52 4.921}
{0 CHEMBL405159,1 1,42 1,52 4.796}
{0 CHEMBL408508,1 1,34 1,42 1,52 4.086}
{0 CHEMBL408815,1 1,42 1,52 4.824}
{0 CHEMBL411410,1 1,42 1,52 4.187}
{0 CHEMBL411650,1 1,42 1,52 4.602}
{0 CHEMBL411671,1 1,42 1,52 4.721}
{0 CHEMBL412036,1 1,42 1,52 4.495}
{0 CHEMBL412148,1 1,42 1,52 4.62}
{0 CHEMBL412383,1 1,42 1,52 4.377}
{0 CHEMBL412975,1 1,42 1,52 4.018}
{0 CHEMBL412981,1 1,42 1,52 4.268}
{0 CHEMBL413598,1 1,42 1,52 4.509}
{0 CHEMBL414106,1 1,42 1,52 4.538}
{0 CHEMBL414280,1 1,42 1,52 3.839}
{0 CHEMBL414353,1 1,42 1,52 4.699}
{0 CHEMBL414837,1 1,42 1,52 3.87}
{0 CHEMBL415388,1 1,42 1,52 4.208}
{0 CHEMBL425814,1 1,42 1,52 4.886}
{0 CHEMBL427955,1 1,42 1,52 3.879}
{0 CHEMBL428305,1 1,42 1,52 4.481}
{0 CHEMBL429021,1 1,42 1,52 3.623}
{0 CHEMBL436685,1 1,42 1,52 4.721}
{0 CHEMBL436785,1 1,42 1,52 5.319}
{0 CHEMBL439002,1 1,42 1,52 4.854}
{0 CHEMBL439486,1 1,42 1,52 3.951}
