"molecule_id","AMW","C.","pXC50"
{1 8.837,2 38.6,3 4.824}
{0 CHEMBL286594,1 8.141,2 44.7,3 7.541}
{0 CHEMBL35571,1 8.488,2 46.5,3 5.699}
{0 CHEMBL394710,1 9.041,2 48.4,3 5.824}
{0 CHEMBL443736,1 7.731,2 41.8,3 5.301}
{0 CHEMBL449393,1 8.191,2 45.5,3 7.266}
{0 CHEMBL45198,1 8.402,2 47.8,3 7.181}
{0 CHEMBL45346,1 8.581,2 41.2,3 5.046}
{0 CHEMBL471977,1 7.097,2 37.9,3 7.232}
{0 CHEMBL471978,1 8.438,2 45.7,3 7}
{0 CHEMBL499964,1 8.331,2 50.6,3 5.301}
{0 CHEMBL505768,1 8.371,2 51.8,3 5.301}
{0 CHEMBL522055,1 8.078,2 50,3 6}
{0 CHEMBL58757,1 7.668,2 43.2,3 4.287}
{0 CHEMBL6597,1 8.588,2 39.5,3 8.292}
{0 CHEMBL911,1 6.987,2 43.2,3 4.824}
