"molecule_id","FCFP4_1024b908","FCFP4_1024b669","FCFP4_1024b55","FCFP4_1024b360","FCFP4_1024b668","FCFP4_1024b733","FCFP4_1024b667","FCFP4_1024b483","FCFP4_1024b557","FCFP4_1024b381","FCFP4_1024b347","FCFP4_1024b499","FCFP4_1024b795","FCFP4_1024b812","FCFP4_1024b998","FCFP4_1024b209","FCFP4_1024b61","FCFP4_1024b35","FCFP4_1024b378","FCFP4_1024b108","FCFP4_1024b902","FCFP4_1024b1","FCFP4_1024b10","FCFP4_1024b100","FCFP4_1024b1000","FCFP4_1024b1001","FCFP4_1024b1002","FCFP4_1024b1003","FCFP4_1024b1004","FCFP4_1024b1005","FCFP4_1024b1006","FCFP4_1024b1007","FCFP4_1024b1008","FCFP4_1024b1009","FCFP4_1024b101","FCFP4_1024b1010","FCFP4_1024b1011","FCFP4_1024b1012","FCFP4_1024b1013","FCFP4_1024b1014","FCFP4_1024b1015","FCFP4_1024b1016","FCFP4_1024b1017","FCFP4_1024b1018","FCFP4_1024b1019","FCFP4_1024b102","FCFP4_1024b1020","FCFP4_1024b1021","FCFP4_1024b1022","FCFP4_1024b1023","FCFP4_1024b1024","FCFP4_1024b103","FCFP4_1024b104","FCFP4_1024b105","FCFP4_1024b106","FCFP4_1024b107","FCFP4_1024b109","FCFP4_1024b11","FCFP4_1024b110","FCFP4_1024b111","FCFP4_1024b112","FCFP4_1024b113","FCFP4_1024b114","FCFP4_1024b115","FCFP4_1024b116","FCFP4_1024b117","FCFP4_1024b118","FCFP4_1024b119","FCFP4_1024b12","FCFP4_1024b120","FCFP4_1024b121","FCFP4_1024b122","FCFP4_1024b123","FCFP4_1024b124","FCFP4_1024b125","FCFP4_1024b126","FCFP4_1024b127","FCFP4_1024b128","FCFP4_1024b129","FCFP4_1024b13","FCFP4_1024b130","FCFP4_1024b131","FCFP4_1024b132","FCFP4_1024b133","FCFP4_1024b134","FCFP4_1024b135","FCFP4_1024b136","FCFP4_1024b137","FCFP4_1024b138","FCFP4_1024b139","FCFP4_1024b14","FCFP4_1024b140","FCFP4_1024b141","FCFP4_1024b142","FCFP4_1024b143","FCFP4_1024b144","FCFP4_1024b145","FCFP4_1024b146","FCFP4_1024b147","FCFP4_1024b148","FCFP4_1024b149","FCFP4_1024b15","pXC50"
{1 1,2 1,22 1,55 1,62 1,63 1,73 1,85 1,103 4}
{0 CHEMBL102688,1 1,2 1,22 1,46 1,49 1,55 1,62 1,63 1,73 1,85 1,103 5.449}
{0 CHEMBL103817,1 1,2 1,22 1,55 1,62 1,63 1,73 1,84 1,85 1,103 8.109}
{0 CHEMBL104010,1 1,2 1,22 1,55 1,62 1,63 1,73 1,85 1,103 4}
{0 CHEMBL104052,1 1,2 1,22 1,55 1,62 1,63 1,73 1,85 1,103 4}
{0 CHEMBL104397,1 1,2 1,22 1,55 1,62 1,63 1,73 1,84 1,85 1,103 4}
{0 CHEMBL104880,1 1,2 1,22 1,55 1,62 1,63 1,73 1,85 1,103 4}
{0 CHEMBL105113,1 1,2 1,22 1,55 1,62 1,63 1,73 1,85 1,103 5.62}
{0 CHEMBL106959,1 1,2 1,22 1,55 1,62 1,63 1,73 1,85 1,103 5.301}
{0 CHEMBL1093304,1 1,2 1,22 1,23 1,43 1,45 1,47 1,59 1,62 1,82 1,90 1,103 7.658}
{0 CHEMBL1209788,1 1,2 1,22 1,23 1,45 1,47 1,58 1,59 1,90 1,103 8.469}
{0 CHEMBL138212,1 1,2 1,22 1,55 1,62 1,63 1,73 1,85 1,103 6.194}
{0 CHEMBL138771,1 1,2 1,22 1,63 1,73 1,103 6.585}
{0 CHEMBL140324,1 1,2 1,6 1,22 1,63 1,73 1,85 1,103 4.565}
{0 CHEMBL140847,1 1,2 1,22 1,63 1,73 1,85 1,103 6.056}
{0 CHEMBL151906,1 1,2 1,22 1,55 1,62 1,85 1,103 6.845}
{0 CHEMBL152555,1 1,2 1,22 1,55 1,62 1,85 1,103 4.936}
{0 CHEMBL152612,1 1,2 1,22 1,55 1,62 1,63 1,73 1,85 1,103 7.764}
{0 CHEMBL152986,1 1,2 1,22 1,55 1,62 1,85 1,103 5.108}
{0 CHEMBL153420,1 1,2 1,22 1,49 1,55 1,62 1,85 1,103 5.259}
{0 CHEMBL154153,1 1,2 1,22 1,55 1,62 1,85 1,103 6.585}
{0 CHEMBL154251,1 1,2 1,22 1,55 1,62 1,85 1,103 6}
{0 CHEMBL1688104,1 1,2 1,6 1,7 1,10 1,22 1,47 1,55 1,63 1,64 1,73 1,85 1,103 6.456}
{0 CHEMBL1688105,1 1,2 1,6 1,7 1,10 1,22 1,47 1,55 1,63 1,64 1,73 1,85 1,103 5.514}
{0 CHEMBL1688106,1 1,2 1,6 1,7 1,10 1,22 1,47 1,55 1,63 1,64 1,73 1,74 1,85 1,103 5.493}
{0 CHEMBL1688107,1 1,2 1,22 1,47 1,55 1,63 1,64 1,73 1,85 1,103 9.67}
{0 CHEMBL1688108,1 1,2 1,6 1,7 1,10 1,22 1,47 1,55 1,62 1,63 1,64 1,73 1,85 1,103 6.187}
{0 CHEMBL1688109,1 1,2 1,6 1,7 1,10 1,22 1,47 1,55 1,63 1,64 1,73 1,74 1,85 1,103 5.564}
{0 CHEMBL1688110,1 1,2 1,6 1,7 1,10 1,22 1,47 1,55 1,63 1,64 1,73 1,85 1,103 7.071}
{0 CHEMBL1688111,1 1,2 1,6 1,7 1,10 1,22 1,47 1,55 1,63 1,64 1,73 1,85 1,103 6.415}
{0 CHEMBL190366,1 1,2 1,22 1,54 1,55 1,63 1,73 1,85 1,103 7.686}
{0 CHEMBL191303,1 1,2 1,22 1,54 1,55 1,63 1,73 1,85 1,103 8.599}
{0 CHEMBL191304,1 1,2 1,22 1,54 1,55 1,63 1,73 1,85 1,103 7.67}
{0 CHEMBL193151,1 1,2 1,22 1,54 1,55 1,63 1,73 1,85 1,103 7.879}
{0 CHEMBL194217,1 1,2 1,22 1,54 1,55 1,63 1,73 1,85 1,103 7.721}
{0 CHEMBL195439,1 1,2 1,22 1,54 1,55 1,63 1,73 1,85 1,103 8.943}
{0 CHEMBL195468,1 1,2 1,22 1,55 1,63 1,72 1,73 1,85 1,103 7.631}
{0 CHEMBL2096693,1 1,2 1,22 1,47 1,55 1,62 1,85 1,103 5.071}
{0 CHEMBL2096710,1 1,2 1,22 1,47 1,64 1,103 6.681}
{0 CHEMBL2096712,1 1,2 1,22 1,54 1,55 1,62 1,63 1,73 1,85 1,103 10.276}
{0 CHEMBL2096713,1 1,2 1,3 1,4 1,5 1,22 1,47 1,55 1,63 1,73 1,85 1,103 9.886}
{0 CHEMBL2096714,1 1,2 1,3 1,4 1,5 1,22 1,47 1,63 1,73 1,103 9.194}
{0 CHEMBL2096715,1 1,2 1,3 1,4 1,5 1,22 1,46 1,47 1,49 1,63 1,73 1,103 6.939}
{0 CHEMBL2096716,1 1,2 1,3 1,4 1,5 1,22 1,47 1,55 1,74 1,85 1,103 5.143}
{0 CHEMBL2096717,1 1,2 1,3 1,4 1,5 1,22 1,47 1,55 1,84 1,85 1,103 9.569}
{0 CHEMBL2096718,1 1,2 1,3 1,4 1,5 1,22 1,47 1,55 1,84 1,85 1,103 9.174}
{0 CHEMBL2096719,1 1,2 1,3 1,4 1,5 1,22 1,47 1,55 1,85 1,103 7.371}
{0 CHEMBL2096720,1 1,2 1,3 1,4 1,5 1,22 1,47 1,55 1,85 1,103 6.585}
{0 CHEMBL2096721,1 1,2 1,3 1,4 1,5 1,22 1,47 1,63 1,73 1,103 9.444}
{0 CHEMBL2096722,1 1,2 1,3 1,4 1,5 1,22 1,47 1,55 1,63 1,73 1,85 1,103 4.833}
{0 CHEMBL2096723,1 1,3 1,4 1,5 1,22 1,47 1,55 1,63 1,73 1,85 1,103 7.488}
{0 CHEMBL2096724,1 1,2 1,3 1,4 1,5 1,22 1,47 1,55 1,85 1,103 6.149}
{0 CHEMBL2096725,1 1,2 1,3 1,4 1,5 1,22 1,47 1,63 1,73 1,74 1,103 9.201}
{0 CHEMBL2096726,1 1,2 1,3 1,4 1,5 1,22 1,47 1,55 1,63 1,73 1,74 1,85 1,103 4.777}
{0 CHEMBL2096729,1 1,2 1,3 1,4 1,5 1,22 1,47 1,55 1,63 1,73 1,85 1,103 9.244}
{0 CHEMBL2096730,1 1,2 1,3 1,4 1,5 1,22 1,47 1,55 1,63 1,73 1,74 1,85 1,103 5.367}
{0 CHEMBL2096731,1 1,3 1,4 1,5 1,22 1,47 1,55 1,63 1,73 1,85 1,103 5.066}
{0 CHEMBL2096745,1 1,2 1,22 1,47 1,55 1,62 1,85 1,103 4.405}
{0 CHEMBL2096818,1 1,2 1,3 1,4 1,5 1,22 1,47 1,55 1,63 1,73 1,85 1,103 9.244}
{0 CHEMBL2096819,1 1,2 1,3 1,4 1,5 1,22 1,47 1,55 1,63 1,73 1,85 1,103 9.18}
{0 CHEMBL2112213,15 1,16 1,22 1,56 1,63 1,73 1,103 6.398}
{0 CHEMBL214332,1 1,2 1,3 1,4 1,5 1,8 1,18 1,19 1,22 1,55 1,62 1,63 1,73 1,74 1,85 1,103 8.553}
{0 CHEMBL216295,1 1,2 1,22 1,55 1,62 1,63 1,73 1,85 1,103 10.06}
{0 CHEMBL224277,1 1,2 1,4 1,5 1,8 1,22 1,54 1,55 1,62 1,63 1,72 1,73 1,85 1,103 10.398}
{0 CHEMBL2304246,1 1,2 1,4 1,5 1,8 1,22 1,47 1,64 1,74 1,103 4.668}
{0 CHEMBL2304247,1 1,2 1,4 1,5 1,8 1,22 1,47 1,64 1,74 1,103 8.172}
{0 CHEMBL2304248,1 1,2 1,4 1,5 1,8 1,22 1,47 1,64 1,74 1,103 4.424}
{0 CHEMBL2304249,1 1,2 1,4 1,5 1,8 1,22 1,47 1,64 1,74 1,103 5.319}
{0 CHEMBL2304250,1 1,2 1,4 1,5 1,8 1,22 1,47 1,64 1,74 1,103 5.081}
{0 CHEMBL2304320,1 1,2 1,4 1,5 1,8 1,22 1,47 1,64 1,74 1,103 5.079}
{0 CHEMBL2323529,1 1,2 1,6 1,7 1,10 1,22 1,47 1,55 1,64 1,85 1,103 6.678}
{0 CHEMBL2323785,1 1,2 1,6 1,7 1,10 1,22 1,47 1,55 1,64 1,84 1,85 1,103 6.658}
{0 CHEMBL2323786,1 1,2 1,6 1,7 1,10 1,22 1,47 1,55 1,64 1,84 1,85 1,103 7.301}
{0 CHEMBL2323787,1 1,2 1,6 1,7 1,10 1,22 1,47 1,55 1,64 1,85 1,103 6.009}
{0 CHEMBL2323788,1 1,2 1,6 1,7 1,10 1,22 1,47 1,63 1,64 1,73 1,103 6.152}
{0 CHEMBL2323789,1 1,2 1,6 1,7 1,10 1,22 1,47 1,63 1,64 1,73 1,103 6.538}
{0 CHEMBL2323790,1 1,2 1,6 1,7 1,10 1,22 1,47 1,54 1,63 1,64 1,73 1,74 1,103 6.62}
{0 CHEMBL2323791,1 1,2 1,6 1,7 1,10 1,22 1,47 1,55 1,63 1,64 1,73 1,74 1,85 1,103 5.268}
{0 CHEMBL2323792,1 1,2 1,6 1,7 1,10 1,22 1,47 1,55 1,63 1,64 1,73 1,85 1,103 4.697}
{0 CHEMBL2323793,1 1,2 1,6 1,7 1,10 1,22 1,47 1,55 1,63 1,64 1,73 1,85 1,103 6.886}
{0 CHEMBL2323794,1 1,2 1,6 1,7 1,10 1,22 1,47 1,55 1,63 1,64 1,73 1,84 1,85 1,103 6.721}
{0 CHEMBL2323795,1 1,2 1,6 1,7 1,10 1,22 1,47 1,55 1,63 1,64 1,73 1,85 1,90 1,103 7.699}
{0 CHEMBL2323796,1 1,2 1,6 1,7 1,10 1,22 1,47 1,55 1,63 1,64 1,73 1,85 1,103 6.119}
{0 CHEMBL2323797,1 1,2 1,6 1,7 1,10 1,22 1,47 1,55 1,63 1,64 1,73 1,85 1,103 5.886}
{0 CHEMBL2323798,1 1,2 1,6 1,7 1,10 1,22 1,47 1,55 1,63 1,64 1,73 1,85 1,103 6.377}
{0 CHEMBL2323799,1 1,2 1,6 1,7 1,10 1,22 1,47 1,55 1,63 1,64 1,73 1,85 1,103 6.015}
{0 CHEMBL2323800,1 1,2 1,7 1,22 1,47 1,54 1,55 1,63 1,64 1,73 1,83 1,85 1,86 1,103 5.896}
{0 CHEMBL264190,1 1,2 1,22 1,55 1,62 1,63 1,73 1,85 1,103 7.971}
{0 CHEMBL264536,1 1,2 1,3 1,4 1,5 1,8 1,22 1,55 1,62 1,63 1,73 1,85 1,103 9.027}
{0 CHEMBL265236,1 1,2 1,22 1,54 1,55 1,63 1,73 1,85 1,103 7.575}
{0 CHEMBL266288,1 1,2 1,3 1,4 1,5 1,8 1,18 1,19 1,22 1,47 1,55 1,64 1,69 1,74 1,85 1,103 8.144}
{0 CHEMBL266647,1 1,2 1,22 1,23 1,54 1,86 1,90 1,103 7.745}
{0 CHEMBL267794,1 1,2 1,3 1,4 1,5 1,8 1,22 1,55 1,62 1,63 1,73 1,85 1,103 9.347}
{0 CHEMBL269274,1 1,2 1,3 1,4 1,5 1,8 1,18 1,19 1,22 1,47 1,55 1,63 1,64 1,68 1,69 1,73 1,74 1,85 1,91 1,103 8.836}
{0 CHEMBL269837,2 1,22 1,103 4.456}
{0 CHEMBL270270,22 1,90 1,103 6.62}
{0 CHEMBL270689,2 1,22 1,103 4}
{0 CHEMBL270923,1 1,2 1,22 1,63 1,73 1,103 6.824}
{0 CHEMBL271586,1 1,2 1,22 1,54 1,63 1,72 1,73 1,103 8.301}
{0 CHEMBL272437,22 1,63 1,73 1,84 1,90 1,103 4}
{0 CHEMBL272660,1 1,2 1,22 1,54 1,63 1,72 1,73 1,103 8.398}
{0 CHEMBL272662,11 1,12 1,13 1,14 1,22 1,72 1,103 4}
{0 CHEMBL272843,22 1,63 1,73 1,103 4}
{0 CHEMBL273044,22 1,34 1,103 5.706}
{0 CHEMBL275303,1 1,2 1,22 1,47 1,63 1,73 1,103 4.932}
{0 CHEMBL287895,1 1,2 1,20 1,22 1,72 1,103 5.658}
{0 CHEMBL289532,1 1,2 1,22 1,72 1,90 1,103 4.801}
{0 CHEMBL291870,15 1,16 1,22 1,72 1,103 4}
{0 CHEMBL293673,15 1,16 1,22 1,63 1,72 1,73 1,103 4}
{0 CHEMBL302703,1 1,2 1,22 1,55 1,62 1,63 1,73 1,85 1,103 5.179}
{0 CHEMBL303283,15 1,16 1,22 1,63 1,72 1,73 1,103 4}
{0 CHEMBL305132,15 1,16 1,22 1,23 1,63 1,72 1,73 1,90 1,103 5.553}
{0 CHEMBL305391,15 1,16 1,22 1,63 1,72 1,73 1,103 4}
{0 CHEMBL305559,15 1,16 1,22 1,63 1,72 1,73 1,103 4.625}
{0 CHEMBL307457,1 1,2 1,3 1,4 1,5 1,8 1,22 1,55 1,62 1,63 1,73 1,85 1,103 8.366}
{0 CHEMBL317210,1 1,2 1,22 1,55 1,62 1,63 1,73 1,85 1,103 4}
{0 CHEMBL317228,1 1,2 1,22 1,55 1,62 1,63 1,73 1,85 1,103 4.393}
{0 CHEMBL317968,1 1,2 1,22 1,62 1,63 1,73 1,103 6.893}
{0 CHEMBL317969,1 1,2 1,22 1,62 1,63 1,73 1,103 6.052}
{0 CHEMBL318119,1 1,2 1,22 1,55 1,62 1,63 1,73 1,85 1,103 4}
{0 CHEMBL319871,1 1,2 1,22 1,55 1,62 1,63 1,73 1,85 1,103 7.165}
{0 CHEMBL319922,1 1,2 1,22 1,55 1,62 1,63 1,73 1,85 1,103 4}
{0 CHEMBL320157,1 1,2 1,22 1,63 1,73 1,74 1,103 5.824}
{0 CHEMBL321870,1 1,2 1,22 1,55 1,62 1,63 1,73 1,85 1,103 6.519}
{0 CHEMBL322610,1 1,2 1,22 1,55 1,62 1,63 1,73 1,85 1,90 1,103 7.602}
{0 CHEMBL322889,1 1,2 1,22 1,55 1,62 1,63 1,73 1,85 1,103 4}
{0 CHEMBL327479,1 1,2 1,22 1,62 1,63 1,73 1,103 7.151}
{0 CHEMBL329490,1 1,2 1,22 1,62 1,63 1,73 1,84 1,103 5.824}
{0 CHEMBL329847,1 1,2 1,22 1,62 1,63 1,73 1,103 5.664}
{0 CHEMBL330233,1 1,2 1,22 1,62 1,63 1,73 1,103 6}
{0 CHEMBL330561,1 1,2 1,22 1,55 1,62 1,63 1,73 1,88 1,103 7.04}
{0 CHEMBL333283,1 1,2 1,22 1,90 1,103 7.42}
{0 CHEMBL339053,1 1,2 1,22 1,88 1,90 1,103 8.119}
{0 CHEMBL340355,1 1,2 1,22 1,90 1,103 7.229}
{0 CHEMBL343094,1 1,2 1,22 1,55 1,62 1,63 1,73 1,85 1,103 5.959}
{0 CHEMBL346925,1 1,2 1,22 1,55 1,62 1,85 1,103 5.268}
{0 CHEMBL347216,1 1,2 1,22 1,55 1,62 1,84 1,85 1,103 7.335}
{0 CHEMBL347364,1 1,2 1,22 1,55 1,62 1,85 1,103 5.569}
{0 CHEMBL348901,1 1,2 1,22 1,55 1,62 1,85 1,103 5.824}
{0 CHEMBL349795,1 1,2 1,22 1,55 1,62 1,85 1,88 1,103 5.09}
{0 CHEMBL350012,1 1,2 1,22 1,55 1,62 1,85 1,103 4.559}
{0 CHEMBL357558,1 1,2 1,22 1,55 1,62 1,84 1,85 1,103 7.801}
{0 CHEMBL358833,1 1,2 1,22 1,55 1,62 1,85 1,103 5.108}
{0 CHEMBL359318,1 1,2 1,22 1,55 1,62 1,85 1,103 4.36}
{0 CHEMBL364346,1 1,2 1,22 1,23 1,42 1,47 1,90 1,103 5.373}
{0 CHEMBL364726,1 1,2 1,22 1,55 1,63 1,72 1,73 1,85 1,103 7.873}
{0 CHEMBL370254,1 1,2 1,22 1,55 1,63 1,73 1,85 1,103 7.733}
{0 CHEMBL370261,1 1,2 1,22 1,54 1,55 1,63 1,73 1,85 1,103 7.979}
{0 CHEMBL384224,20 1,22 1,54 1,82 1,103 4}
{0 CHEMBL386081,1 1,2 1,3 1,4 1,5 1,8 1,22 1,55 1,62 1,63 1,73 1,85 1,103 9.357}
{0 CHEMBL386583,1 1,2 1,4 1,5 1,8 1,22 1,55 1,62 1,63 1,73 1,74 1,85 1,103 10.06}
{0 CHEMBL386729,1 1,2 1,22 1,54 1,103 6.98}
{0 CHEMBL393576,1 1,2 1,22 1,29 1,34 1,44 1,47 1,90 1,103 9.149}
{0 CHEMBL398929,1 1,2 1,22 1,23 1,27 1,47 1,52 1,59 1,78 1,81 1,82 1,90 1,103 9.222}
{0 CHEMBL402258,1 1,2 1,22 1,54 1,82 1,103 5.495}
{0 CHEMBL40233,1 1,2 1,22 1,72 1,78 1,90 1,103 6.658}
{0 CHEMBL405087,1 1,2 1,22 1,47 1,55 1,63 1,64 1,73 1,85 1,103 9.699}
{0 CHEMBL405174,1 1,2 1,22 1,56 1,63 1,73 1,84 1,103 7.676}
{0 CHEMBL405335,1 1,2 1,18 1,19 1,22 1,55 1,62 1,63 1,73 1,74 1,85 1,103 9.347}
{0 CHEMBL406032,1 1,2 1,4 1,5 1,22 1,54 1,55 1,56 1,63 1,73 1,75 1,85 1,103 6.403}
{0 CHEMBL406550,1 1,2 1,4 1,5 1,22 1,54 1,63 1,73 1,75 1,82 1,103 5.338}
{0 CHEMBL406651,22 1,103 4}
{0 CHEMBL406842,1 1,2 1,22 1,47 1,55 1,63 1,64 1,73 1,85 1,90 1,103 9.174}
{0 CHEMBL406891,1 1,2 1,22 1,47 1,55 1,63 1,64 1,73 1,85 1,103 7.292}
{0 CHEMBL406985,1 1,2 1,22 1,54 1,63 1,73 1,103 7.745}
{0 CHEMBL40711,1 1,2 1,22 1,78 1,90 1,103 6.796}
{0 CHEMBL407346,1 1,2 1,4 1,5 1,22 1,47 1,64 1,103 6.81}
{0 CHEMBL408398,1 1,2 1,22 1,54 1,63 1,73 1,103 8.398}
{0 CHEMBL40857,1 1,2 1,22 1,72 1,90 1,103 5.569}
{0 CHEMBL408600,1 1,2 1,4 1,5 1,8 1,22 1,55 1,62 1,63 1,73 1,74 1,85 1,103 10.222}
{0 CHEMBL409190,1 1,2 1,22 1,47 1,64 1,69 1,103 6.8}
{0 CHEMBL409495,1 1,2 1,4 1,5 1,8 1,22 1,47 1,64 1,74 1,103 7.5}
{0 CHEMBL410091,1 1,2 1,4 1,5 1,22 1,54 1,63 1,73 1,75 1,82 1,103 5}
{0 CHEMBL410404,1 1,2 1,22 1,47 1,55 1,63 1,64 1,73 1,85 1,103 8.854}
{0 CHEMBL410435,22 1,103 4}
{0 CHEMBL410763,1 1,2 1,3 1,4 1,5 1,8 1,22 1,55 1,62 1,63 1,73 1,85 1,103 9.108}
{0 CHEMBL411378,1 1,2 1,22 1,47 1,55 1,63 1,64 1,73 1,85 1,103 8.051}
{0 CHEMBL411400,1 1,2 1,8 1,22 1,47 1,55 1,63 1,64 1,73 1,85 1,103 7.699}
{0 CHEMBL411775,1 1,2 1,4 1,5 1,22 1,54 1,55 1,56 1,63 1,73 1,75 1,85 1,103 9.585}
{0 CHEMBL413465,1 1,2 1,4 1,5 1,22 1,54 1,63 1,73 1,75 1,82 1,103 4.893}
{0 CHEMBL414900,1 1,2 1,4 1,5 1,22 1,54 1,55 1,56 1,75 1,85 1,103 4}
{0 CHEMBL414965,1 1,2 1,22 1,54 1,55 1,63 1,72 1,73 1,85 1,103 9.42}
{0 CHEMBL415200,1 1,2 1,22 1,47 1,55 1,63 1,64 1,73 1,85 1,103 6.745}
{0 CHEMBL416244,1 1,2 1,22 1,72 1,78 1,90 1,103 7.174}
{0 CHEMBL426282,1 1,2 1,22 1,54 1,55 1,63 1,73 1,85 1,103 7.842}
{0 CHEMBL427860,1 1,2 1,22 1,23 1,45 1,54 1,86 1,90 1,103 8.495}
{0 CHEMBL428134,1 1,2 1,3 1,4 1,5 1,8 1,18 1,19 1,22 1,47 1,55 1,64 1,69 1,74 1,85 1,103 8.392}
{0 CHEMBL429236,1 1,2 1,3 1,4 1,5 1,8 1,18 1,19 1,22 1,55 1,62 1,63 1,73 1,74 1,85 1,103 9.495}
{0 CHEMBL430239,1 1,2 1,22 1,54 1,55 1,62 1,63 1,72 1,73 1,85 1,103 10.06}
{0 CHEMBL430489,1 1,2 1,22 1,55 1,62 1,63 1,73 1,85 1,103 4.613}
{0 CHEMBL430843,1 1,2 1,22 1,55 1,62 1,63 1,73 1,85 1,103 4.955}
{0 CHEMBL431092,1 1,2 1,22 1,62 1,63 1,73 1,103 6.676}
{0 CHEMBL431242,1 1,2 1,22 1,55 1,62 1,63 1,73 1,85 1,103 4.465}
{0 CHEMBL431523,15 1,16 1,22 1,63 1,72 1,73 1,103 4}
{0 CHEMBL432018,1 1,2 1,22 1,55 1,62 1,63 1,73 1,85 1,103 4}
{0 CHEMBL432027,1 1,2 1,22 1,62 1,63 1,73 1,103 5.208}
{0 CHEMBL432201,1 1,2 1,22 1,62 1,63 1,73 1,103 6.277}
{0 CHEMBL432895,1 1,2 1,22 1,62 1,63 1,73 1,103 5.635}
{0 CHEMBL433296,1 1,2 1,22 1,55 1,62 1,63 1,73 1,85 1,103 6.812}
{0 CHEMBL433522,1 1,2 1,22 1,55 1,62 1,85 1,103 4.523}
{0 CHEMBL435368,1 1,2 1,22 1,78 1,90 1,103 7.409}
{0 CHEMBL438890,1 1,2 1,4 1,5 1,22 1,54 1,103 6.32}
{0 CHEMBL439490,1 1,2 1,3 1,4 1,5 1,8 1,18 1,19 1,22 1,55 1,62 1,63 1,73 1,74 1,85 1,103 9.699}
{0 CHEMBL439560,1 1,2 1,22 1,44 1,45 1,47 1,69 1,90 1,103 8.26}
{0 CHEMBL440242,1 1,2 1,22 1,54 1,72 1,103 5.84}
{0 CHEMBL440633,1 1,2 1,4 1,5 1,22 1,54 1,63 1,73 1,75 1,82 1,103 5.212}
{0 CHEMBL441988,1 1,2 1,22 1,62 1,63 1,73 1,103 4}
{0 CHEMBL444219,1 1,2 1,22 1,55 1,62 1,63 1,73 1,85 1,90 1,103 9.347}
{0 CHEMBL448536,1 1,2 1,22 1,23 1,55 1,62 1,63 1,73 1,85 1,88 1,103 8.547}
{0 CHEMBL451423,1 1,2 1,22 1,55 1,62 1,63 1,73 1,85 1,103 7.886}
{0 CHEMBL454736,1 1,2 1,22 1,55 1,62 1,63 1,73 1,84 1,85 1,103 7.721}
{0 CHEMBL455826,1 1,2 1,22 1,55 1,62 1,63 1,73 1,85 1,103 7.195}
{0 CHEMBL488355,1 1,2 1,22 1,24 1,55 1,62 1,63 1,73 1,85 1,103 5.361}
{0 CHEMBL491870,1 1,2 1,22 1,55 1,62 1,63 1,73 1,85 1,90 1,103 9.398}
{0 CHEMBL497746,1 1,2 1,22 1,23 1,29 1,54 1,86 1,90 1,103 8.456}
{0 CHEMBL500516,1 1,2 1,22 1,47 1,55 1,62 1,63 1,73 1,85 1,103 6.658}
{0 CHEMBL50056,1 1,2 1,22 1,55 1,62 1,63 1,73 1,85 1,103 5.676}
{0 CHEMBL501394,1 1,2 1,22 1,55 1,62 1,63 1,73 1,85 1,90 1,103 8.469}
{0 CHEMBL501679,1 1,2 1,22 1,55 1,62 1,63 1,69 1,73 1,85 1,103 7.893}
{0 CHEMBL502093,1 1,2 1,22 1,55 1,62 1,63 1,73 1,85 1,90 1,103 8.971}
{0 CHEMBL503449,1 1,2 1,22 1,55 1,62 1,63 1,73 1,85 1,103 8.248}
{0 CHEMBL510687,1 1,2 1,22 1,55 1,62 1,63 1,73 1,85 1,90 1,103 8.063}
{0 CHEMBL565474,11 1,12 1,13 1,14 1,22 1,54 1,55 1,72 1,85 1,103 4.412}
{0 CHEMBL565688,9 1,11 1,12 1,13 1,14 1,17 1,20 1,21 1,22 1,54 1,55 1,72 1,85 1,94 1,103 5.299}
{0 CHEMBL565900,11 1,12 1,13 1,14 1,17 1,21 1,22 1,23 1,55 1,72 1,85 1,103 4.369}
{0 CHEMBL565927,1 1,2 1,9 1,17 1,20 1,21 1,22 1,55 1,78 1,85 1,103 4.219}
{0 CHEMBL566150,9 1,11 1,12 1,13 1,14 1,17 1,20 1,22 1,55 1,72 1,85 1,90 1,103 4.833}
{0 CHEMBL566162,9 1,11 1,12 1,13 1,14 1,17 1,20 1,21 1,22 1,55 1,72 1,85 1,90 1,103 5.397}
{0 CHEMBL566545,1 1,2 1,9 1,17 1,20 1,22 1,55 1,78 1,85 1,103 4.863}
{0 CHEMBL566764,1 1,2 1,17 1,21 1,22 1,55 1,62 1,85 1,103 4.693}
{0 CHEMBL567233,1 1,2 1,9 1,17 1,20 1,21 1,22 1,55 1,78 1,85 1,103 4.939}
{0 CHEMBL567240,9 1,11 1,12 1,13 1,14 1,17 1,20 1,21 1,22 1,55 1,72 1,85 1,103 4.895}
{0 CHEMBL567634,9 1,11 1,12 1,13 1,14 1,17 1,20 1,21 1,22 1,55 1,72 1,85 1,103 5.327}
{0 CHEMBL568409,11 1,12 1,13 1,14 1,22 1,55 1,70 1,72 1,73 1,85 1,103 4.764}
{0 CHEMBL568577,9 1,11 1,12 1,13 1,14 1,17 1,20 1,21 1,22 1,55 1,72 1,85 1,90 1,103 5.284}
{0 CHEMBL568836,11 1,12 1,13 1,14 1,22 1,54 1,55 1,72 1,85 1,90 1,103 4.907}
{0 CHEMBL568940,9 1,11 1,12 1,13 1,14 1,17 1,20 1,21 1,22 1,55 1,72 1,85 1,103 4.627}
{0 CHEMBL568965,9 1,11 1,12 1,13 1,14 1,17 1,20 1,21 1,22 1,55 1,72 1,85 1,103 4.998}
{0 CHEMBL569076,9 1,11 1,12 1,13 1,14 1,17 1,20 1,22 1,55 1,72 1,85 1,90 1,103 4.629}
{0 CHEMBL569086,11 1,12 1,13 1,14 1,22 1,55 1,72 1,85 1,103 4.509}
{0 CHEMBL569220,11 1,12 1,13 1,14 1,17 1,21 1,22 1,55 1,72 1,85 1,103 4.717}
{0 CHEMBL569221,11 1,12 1,13 1,14 1,22 1,54 1,55 1,72 1,85 1,103 4.643}
{0 CHEMBL569693,1 1,11 1,12 1,13 1,14 1,22 1,54 1,63 1,72 1,73 1,103 9.268}
{0 CHEMBL569694,11 1,12 1,13 1,14 1,22 1,54 1,55 1,72 1,85 1,103 4.82}
{0 CHEMBL569695,9 1,11 1,12 1,13 1,14 1,17 1,20 1,21 1,22 1,55 1,72 1,85 1,103 4.276}
{0 CHEMBL569696,9 1,11 1,12 1,13 1,14 1,17 1,20 1,21 1,22 1,45 1,55 1,69 1,72 1,85 1,103 5.432}
{0 CHEMBL569697,9 1,11 1,12 1,13 1,14 1,17 1,20 1,21 1,22 1,55 1,72 1,85 1,103 4.742}
{0 CHEMBL570903,11 1,12 1,13 1,14 1,22 1,54 1,55 1,72 1,85 1,103 4.593}
{0 CHEMBL589308,1 1,2 1,6 1,22 1,62 1,63 1,73 1,103 7.979}
{0 CHEMBL589468,1 1,2 1,22 1,44 1,54 1,63 1,73 1,103 6.194}
{0 CHEMBL589515,1 1,2 1,22 1,63 1,73 1,103 7.151}
{0 CHEMBL589516,1 1,2 1,22 1,54 1,63 1,73 1,103 5.417}
{0 CHEMBL589517,1 1,2 1,22 1,54 1,63 1,73 1,103 5.481}
{0 CHEMBL602299,1 1,2 1,6 1,22 1,44 1,54 1,63 1,73 1,103 5.77}
{0 CHEMBL602650,1 1,2 1,22 1,62 1,63 1,73 1,103 5.008}
{0 CHEMBL602651,1 1,2 1,22 1,62 1,63 1,73 1,103 8.056}
{0 CHEMBL602652,1 1,2 1,22 1,44 1,54 1,63 1,73 1,103 5.863}
{0 CHEMBL602653,1 1,2 1,6 1,22 1,44 1,54 1,63 1,73 1,103 5.708}
{0 CHEMBL602852,1 1,2 1,6 1,22 1,44 1,54 1,63 1,73 1,103 5.648}
{0 CHEMBL602853,1 1,2 1,22 1,44 1,54 1,63 1,73 1,103 7.31}
{0 CHEMBL607103,1 1,2 1,22 1,47 1,55 1,62 1,63 1,73 1,85 1,103 4}
{0 CHEMBL607104,1 1,2 1,22 1,47 1,55 1,62 1,63 1,73 1,85 1,103 4}
{0 CHEMBL61681,15 1,16 1,22 1,45 1,63 1,73 1,103 4}
{0 CHEMBL62228,2 1,9 1,15 1,22 1,63 1,72 1,73 1,91 1,103 5.469}
{0 CHEMBL63850,2 1,9 1,15 1,22 1,31 1,63 1,72 1,73 1,86 1,103 4}
{0 CHEMBL63867,15 1,16 1,22 1,72 1,103 4}
{0 CHEMBL64954,15 1,16 1,22 1,63 1,72 1,73 1,103 4.625}
{0 CHEMBL64967,15 1,16 1,22 1,23 1,63 1,73 1,103 4}
{0 CHEMBL65339,1 1,2 1,22 1,62 1,63 1,73 1,103 4.951}
{0 CHEMBL94369,1 1,2 1,22 1,62 1,63 1,73 1,84 1,103 5.538}
{0 CHEMBL94391,1 1,2 1,22 1,55 1,62 1,63 1,73 1,85 1,103 6.296}
{0 CHEMBL96531,1 1,2 1,22 1,46 1,49 1,62 1,63 1,73 1,103 6.146}
{0 CHEMBL96871,1 1,2 1,22 1,47 1,63 1,73 1,103 5.538}
