"molecule_id","FCFP4_1024b1","FCFP4_1024b10","FCFP4_1024b100","FCFP4_1024b1000","FCFP4_1024b1001","FCFP4_1024b1002","FCFP4_1024b1003","FCFP4_1024b1004","FCFP4_1024b1005","FCFP4_1024b1006","FCFP4_1024b1007","FCFP4_1024b1008","FCFP4_1024b1009","FCFP4_1024b101","FCFP4_1024b1010","FCFP4_1024b1011","FCFP4_1024b1012","FCFP4_1024b1013","FCFP4_1024b1014","FCFP4_1024b1015","FCFP4_1024b1016","FCFP4_1024b1017","FCFP4_1024b1018","FCFP4_1024b1019","FCFP4_1024b102","FCFP4_1024b1020","FCFP4_1024b1021","FCFP4_1024b1022","FCFP4_1024b1023","FCFP4_1024b1024","FCFP4_1024b103","FCFP4_1024b104","FCFP4_1024b105","FCFP4_1024b106","FCFP4_1024b107","FCFP4_1024b108","FCFP4_1024b109","FCFP4_1024b11","FCFP4_1024b110","FCFP4_1024b111","FCFP4_1024b112","FCFP4_1024b113","FCFP4_1024b114","FCFP4_1024b115","FCFP4_1024b116","FCFP4_1024b117","FCFP4_1024b118","FCFP4_1024b119","FCFP4_1024b12","FCFP4_1024b120","FCFP4_1024b121","pXC50"
{1 1,16 1,24 1,50 1,52 5.585}
{0 CHEMBL101253,1 1,52 5}
{0 CHEMBL103667,1 1,2 1,35 1,52 5}
{0 CHEMBL105442,1 1,52 5}
{0 CHEMBL1173655,1 1,2 1,35 1,52 5}
{0 CHEMBL119385,1 1,7 1,18 1,52 5}
{0 CHEMBL1230020,1 1,35 1,52 5}
{0 CHEMBL1236107,1 1,52 5}
{0 CHEMBL1241674,1 1,26 1,52 7.745}
{0 CHEMBL124660,1 1,2 1,35 1,52 5}
{0 CHEMBL1287853,1 1,2 1,52 5}
{0 CHEMBL1289926,1 1,4 1,27 1,36 1,50 1,52 5}
{0 CHEMBL1336,1 1,35 1,36 1,49 1,52 5}
{0 CHEMBL1421,1 1,2 1,16 1,35 1,52 5}
{0 CHEMBL1614701,1 1,39 1,52 5}
{0 CHEMBL162,1 1,36 1,44 1,52 5.569}
{0 CHEMBL1721885,1 1,2 1,35 1,50 1,52 5}
{0 CHEMBL1789941,1 1,2 1,39 1,52 5}
{0 CHEMBL180022,1 1,2 1,35 1,52 5}
{0 CHEMBL1908391,1 1,2 1,35 1,38 1,52 5}
{0 CHEMBL1908392,1 1,2 1,8 1,52 5}
{0 CHEMBL1908393,1 1,2 1,35 1,52 5}
{0 CHEMBL1908394,1 1,2 1,49 1,52 5.174}
{0 CHEMBL1908395,1 1,2 1,24 1,35 1,52 5}
{0 CHEMBL1908396,1 1,35 1,52 5}
{0 CHEMBL1908397,1 1,4 1,50 1,52 5}
{0 CHEMBL215152,1 1,2 1,4 1,35 1,50 1,52 5}
{0 CHEMBL221959,1 1,2 1,10 1,52 5}
{0 CHEMBL223360,1 1,4 1,26 1,35 1,52 5}
{0 CHEMBL230011,26 1,52 6.509}
{0 CHEMBL2309006,1 1,7 1,44 1,52 5}
{0 CHEMBL2309609,1 1,8 1,44 1,52 5}
{0 CHEMBL24828,1 1,2 1,52 5}
{0 CHEMBL249697,1 1,35 1,52 5}
{0 CHEMBL255863,1 1,35 1,49 1,52 5}
{0 CHEMBL259084,1 1,15 1,52 5}
{0 CHEMBL261849,1 1,26 1,52 5}
{0 CHEMBL288441,1 1,2 1,52 5}
{0 CHEMBL296468,1 1,35 1,45 1,52 5}
{0 CHEMBL300138,1 1,2 1,52 5.18}
{0 CHEMBL31965,1 1,2 1,35 1,52 5}
{0 CHEMBL377300,1 1,50 1,52 5}
{0 CHEMBL379218,1 1,4 1,50 1,52 5}
{0 CHEMBL384304,1 1,2 1,26 1,35 1,52 5}
{0 CHEMBL386051,1 1,52 5}
{0 CHEMBL428690,1 1,2 1,52 5.585}
{0 CHEMBL445813,1 1,4 1,35 1,52 5}
{0 CHEMBL450786,1 1,2 1,24 1,35 1,50 1,52 5}
{0 CHEMBL464552,1 1,2 1,36 1,52 5}
{0 CHEMBL475251,1 1,20 1,35 1,47 1,52 6.886}
{0 CHEMBL477772,1 1,52 5.721}
{0 CHEMBL491473,1 1,2 1,50 1,52 5}
{0 CHEMBL494089,1 1,26 1,38 1,52 5.824}
{0 CHEMBL509032,1 1,2 1,52 5}
{0 CHEMBL513909,1 1,2 1,17 1,52 5}
{0 CHEMBL521851,1 1,2 1,4 1,38 1,52 5}
{0 CHEMBL522892,1 1,2 1,31 1,35 1,52 5.367}
{0 CHEMBL525191,1 1,6 1,16 1,23 1,52 5}
{0 CHEMBL535,1 1,2 1,35 1,50 1,52 5}
{0 CHEMBL553,1 1,8 1,52 5}
{0 CHEMBL554,1 1,31 1,52 5}
{0 CHEMBL558752,1 1,35 1,39 1,49 1,52 5}
{0 CHEMBL572878,1 1,2 1,4 1,16 1,35 1,50 1,52 5}
{0 CHEMBL572881,1 1,35 1,52 5}
{0 CHEMBL573339,1 1,21 1,38 1,52 5}
{0 CHEMBL574738,1 1,2 1,16 1,35 1,36 1,49 1,52 5}
{0 CHEMBL576982,1 1,2 1,35 1,38 1,52 5}
{0 CHEMBL601719,1 1,26 1,52 5}
{0 CHEMBL608154,1 1,35 1,52 5}
{0 CHEMBL91829,1 1,2 1,31 1,52 6.292}
{0 CHEMBL939,1 1,2 1,52 5}
{0 CHEMBL941,1 1,2 1,35 1,52 5}
