{
  "data_features": {
    "feature": [
      {
        "data_type": "nominal",
        "index": "0",
        "is_ignore": "false",
        "is_row_identifier": "true",
        "is_target": "false",
        "name": "molecule_id",
        "nominal_value": [
          "CHEMBL118268",
          "CHEMBL118307",
          "CHEMBL118693",
          "CHEMBL119781",
          "CHEMBL121659",
          "CHEMBL122823",
          "CHEMBL1783646",
          "CHEMBL1783648",
          "CHEMBL2111557",
          "CHEMBL2111790",
          "CHEMBL2111791",
          "CHEMBL2111792",
          "CHEMBL2114968",
          "CHEMBL296193",
          "CHEMBL324960",
          "CHEMBL333032",
          "CHEMBL38",
          "CHEMBL43833",
          "CHEMBL44478",
          "CHEMBL44582",
          "CHEMBL44979",
          "CHEMBL46397",
          "CHEMBL46398",
          "CHEMBL547",
          "CHEMBL705",
          "CHEMBL72988",
          "CHEMBL75548"
        ],
        "number_of_missing_values": "0"
      },
      {
        "data_type": "numeric",
        "index": "1",
        "is_ignore": "false",
        "is_row_identifier": "false",
        "is_target": "false",
        "name": "AMW",
        "number_of_missing_values": "0"
      },
      {
        "data_type": "numeric",
        "index": "2",
        "is_ignore": "false",
        "is_row_identifier": "false",
        "is_target": "false",
        "name": "H.",
        "number_of_missing_values": "0"
      },
      {
        "data_type": "numeric",
        "index": "3",
        "is_ignore": "false",
        "is_row_identifier": "false",
        "is_target": "false",
        "name": "Me",
        "number_of_missing_values": "0"
      },
      {
        "data_type": "numeric",
        "index": "4",
        "is_ignore": "false",
        "is_row_identifier": "false",
        "is_target": "false",
        "name": "Mi",
        "number_of_missing_values": "0"
      },
      {
        "data_type": "numeric",
        "index": "5",
        "is_ignore": "false",
        "is_row_identifier": "false",
        "is_target": "true",
        "name": "pXC50",
        "number_of_missing_values": "0"
      }
    ]
  }
}