"molecule_id","AMW","H.","Me","Mi","pXC50"
{1 7.693,2 48.9,3 0.992,4 1.113,5 6}
{0 CHEMBL118307,1 7.293,2 49.1,3 0.998,4 1.116,5 5}
{0 CHEMBL118693,1 6.952,2 51,3 0.985,4 1.112,5 5}
{0 CHEMBL119781,1 7.094,2 50,3 0.986,4 1.111,5 5.389}
{0 CHEMBL121659,1 6.431,2 52.6,3 0.987,4 1.12,5 6.222}
{0 CHEMBL122823,1 6.191,2 54.5,3 0.983,4 1.123,5 7.26}
{0 CHEMBL1783646,1 7.285,2 44.8,3 0.991,4 1.104,5 6.523}
{0 CHEMBL1783648,1 7.076,2 46.7,3 0.989,4 1.107,5 6.398}
{0 CHEMBL2111557,1 5.975,2 56.1,3 0.979,4 1.124,5 6.023}
{0 CHEMBL2111790,1 6.01,2 56,3 0.981,4 1.125,5 6}
{0 CHEMBL2111791,1 6.431,2 52.6,3 0.987,4 1.12,5 5.699}
{0 CHEMBL2111792,1 6.191,2 54.5,3 0.983,4 1.123,5 5.699}
{0 CHEMBL2114968,1 5.934,2 56.6,3 0.979,4 1.125,5 6}
{0 CHEMBL296193,1 6.691,2 50,3 0.986,4 1.113,5 5.699}
{0 CHEMBL324960,1 7.126,2 50,3 0.991,4 1.114,5 5}
{0 CHEMBL333032,1 6.01,2 56,3 0.981,4 1.125,5 8.097}
{0 CHEMBL38,1 6.01,2 56,3 0.981,4 1.125,5 7.741}
{0 CHEMBL43833,1 5.934,2 56.6,3 0.979,4 1.125,5 6}
{0 CHEMBL44478,1 6.01,2 56,3 0.981,4 1.125,5 7.627}
{0 CHEMBL44582,1 5.934,2 56.6,3 0.979,4 1.125,5 6.046}
{0 CHEMBL44979,1 6.691,2 50,3 0.986,4 1.113,5 5.699}
{0 CHEMBL46397,1 6.691,2 50,3 0.986,4 1.113,5 5.699}
{0 CHEMBL46398,1 5.934,2 56.6,3 0.979,4 1.125,5 7.854}
{0 CHEMBL547,1 6.01,2 56,3 0.981,4 1.125,5 6}
{0 CHEMBL705,1 6.01,2 56,3 0.981,4 1.125,5 7.509}
{0 CHEMBL72988,1 5.806,2 57.6,3 0.978,4 1.127,5 5.979}
{0 CHEMBL75548,1 5.755,2 58.2,3 0.978,4 1.128,5 7.509}
