"molecule_id","AMW","C.","H.","Me","Mi","Mp","Mv","MW","N.","nAB","nAT","nB","nBM","nBO","nBR","nBT","nC","nCL","nCsp","nCsp2","nCsp3","nDB","nF","nH","nHet","nHM","nI","nN","nO","nP","nS","nSK","nTB","nX","O.","RBF","RBN","SCBO","Se","Si","Sp","Sv","X.","pXC50"
{1 7.591,2 53.5,3 41.9,4 0.991,5 1.097,6 0.715,7 0.678,8 326.41,10 23,11 43,13 23,14 28,16 46,17 23,20 22,21 1,24 18,25 2,29 2,32 25,35 4.7,36 0.065,37 3,38 39.5,39 42.607,40 47.156,41 30.762,42 29.171,44 6.222}
{0 CHEMBL1094497,1 8.295,2 47.6,3 38.1,4 1.017,5 1.113,6 0.694,7 0.681,8 348.38,9 4.8,10 18,11 42,13 20,14 28,16 44,17 20,20 20,22 2,24 16,25 6,28 2,29 4,32 26,35 9.5,36 0.091,37 4,38 39,39 42.698,40 46.741,41 29.159,42 28.59,44 5.921}
{0 CHEMBL1094498,1 7.393,2 42.3,3 46.2,4 1.011,5 1.12,6 0.651,7 0.627,8 384.46,10 17,11 52,13 17,14 30,16 54,17 22,20 16,21 6,24 24,25 6,29 6,32 28,35 11.5,36 0.13,37 7,38 38.5,39 52.567,40 58.239,41 33.864,42 32.61,44 6.046}
{0 CHEMBL1094828,1 7.702,2 53.8,3 41,4 0.993,5 1.096,6 0.718,7 0.683,8 300.37,10 22,11 39,13 22,14 26,16 42,17 21,20 20,21 1,24 16,25 2,29 2,32 23,35 5.1,36 0.048,37 2,38 37,39 38.723,40 42.74,41 28,42 26.644,44 5.824}
{0 CHEMBL1096784,1 7.649,2 44,3 44,4 1.014,5 1.116,6 0.662,7 0.642,8 382.44,10 18,11 50,13 18,14 30,16 52,17 22,20 18,21 4,24 22,25 6,29 6,32 28,35 12,36 0.115,37 6,38 39,39 50.683,40 55.824,41 33.102,42 32.084,44 5.056}
{0 CHEMBL1098116,1 6.873,2 40.9,3 50,4 1.001,5 1.123,6 0.641,7 0.606,8 302.4,10 12,11 44,13 12,14 23,16 45,17 18,20 12,21 6,24 22,25 4,29 4,32 22,35 9.1,36 0.133,37 6,38 29,39 44.029,40 49.405,41 28.193,42 26.654,44 5.252}
{0 CHEMBL1098117,1 7.033,2 41.5,3 48.8,4 1.004,5 1.122,6 0.645,7 0.613,8 288.37,10 12,11 41,13 12,14 22,16 42,17 17,20 12,21 5,24 20,25 4,29 4,32 21,35 9.8,36 0.143,37 6,38 28,39 41.145,40 45.99,41 26.432,42 25.127,44 5.301}
{0 CHEMBL1098118,1 7.509,2 44.4,3 44.4,4 1.006,5 1.118,6 0.669,7 0.642,8 540.66,9 2.8,10 24,11 72,13 26,14 43,16 75,17 32,20 26,21 6,22 2,24 32,25 8,28 2,29 6,32 40,35 8.3,36 0.147,37 11,38 57,39 72.421,40 80.481,41 48.159,42 46.234,44 5.62}
{0 CHEMBL1098446,1 7.401,2 52.2,3 43.5,4 0.989,5 1.099,6 0.707,7 0.667,8 340.44,10 23,11 46,13 23,14 29,16 49,17 24,20 22,21 2,24 20,25 2,29 2,32 26,35 4.3,36 0.082,37 4,38 40.5,39 45.491,40 50.571,41 32.523,42 30.698,44 5.745}
{0 CHEMBL1098663,1 7.176,2 50,3 45.2,4 0.985,5 1.106,6 0.698,7 0.654,8 301.41,9 2.4,10 18,11 42,13 19,14 25,16 44,17 21,20 19,21 2,22 1,24 19,25 2,28 1,29 1,32 23,35 2.4,36 0.091,37 4,38 35,39 41.382,40 46.445,41 29.313,42 27.477,44 5.77}
{0 CHEMBL165,1 7.871,2 48.3,3 41.4,4 1.01,5 1.108,6 0.687,7 0.666,8 228.26,10 12,11 29,13 13,14 18,16 30,17 14,20 14,22 1,24 12,25 3,29 3,32 17,35 10.3,36 0.067,37 2,38 25,39 29.284,40 32.119,41 19.932,42 19.305,44 4.66}
{0 CHEMBL481409,1 7.259,2 50,3 45,4 0.99,5 1.104,6 0.694,7 0.654,8 290.38,10 18,11 40,13 18,14 24,16 42,17 20,20 18,21 2,24 18,25 2,29 2,32 22,35 5,36 0.095,37 4,38 33,39 39.607,40 44.156,41 27.762,42 26.171,44 6.046}
