{
  "data_features": {
    "feature": [
      {
        "data_type": "nominal",
        "index": "0",
        "is_ignore": "false",
        "is_row_identifier": "true",
        "is_target": "false",
        "name": "molecule_id",
        "nominal_value": [
          "CHEMBL100179",
          "CHEMBL101362",
          "CHEMBL120154",
          "CHEMBL122611",
          "CHEMBL123540",
          "CHEMBL139416",
          "CHEMBL159",
          "CHEMBL16608",
          "CHEMBL170087",
          "CHEMBL170263",
          "CHEMBL17042",
          "CHEMBL170647",
          "CHEMBL171809",
          "CHEMBL172767",
          "CHEMBL173247",
          "CHEMBL173436",
          "CHEMBL173596",
          "CHEMBL173759",
          "CHEMBL174289",
          "CHEMBL17562",
          "CHEMBL17605",
          "CHEMBL17643",
          "CHEMBL17653",
          "CHEMBL1794849",
          "CHEMBL17981",
          "CHEMBL18101",
          "CHEMBL18116",
          "CHEMBL18270",
          "CHEMBL18334",
          "CHEMBL18390",
          "CHEMBL1939847",
          "CHEMBL1939848",
          "CHEMBL1939851",
          "CHEMBL1939853",
          "CHEMBL1939854",
          "CHEMBL1939856",
          "CHEMBL1939857",
          "CHEMBL1939858",
          "CHEMBL1939859",
          "CHEMBL1939860",
          "CHEMBL2096866",
          "CHEMBL2096867",
          "CHEMBL211141",
          "CHEMBL212068",
          "CHEMBL212069",
          "CHEMBL212501",
          "CHEMBL212555",
          "CHEMBL213141",
          "CHEMBL2178425",
          "CHEMBL2178426",
          "CHEMBL2178427",
          "CHEMBL2178428",
          "CHEMBL2178429",
          "CHEMBL2178430",
          "CHEMBL2178431",
          "CHEMBL2178432",
          "CHEMBL2178433",
          "CHEMBL2178434",
          "CHEMBL2178435",
          "CHEMBL2178436",
          "CHEMBL2178437",
          "CHEMBL2178438",
          "CHEMBL2178439",
          "CHEMBL2178440",
          "CHEMBL2178441",
          "CHEMBL2178442",
          "CHEMBL2178980",
          "CHEMBL2178981",
          "CHEMBL2178982",
          "CHEMBL2178983",
          "CHEMBL2178984",
          "CHEMBL2178985",
          "CHEMBL2178986",
          "CHEMBL2178987",
          "CHEMBL2178988",
          "CHEMBL2178989",
          "CHEMBL2178990",
          "CHEMBL2178991",
          "CHEMBL2178992",
          "CHEMBL2178993",
          "CHEMBL217916",
          "CHEMBL218073",
          "CHEMBL219679",
          "CHEMBL220116",
          "CHEMBL220264",
          "CHEMBL220265",
          "CHEMBL220495",
          "CHEMBL220548",
          "CHEMBL220677",
          "CHEMBL220678",
          "CHEMBL220832",
          "CHEMBL220891",
          "CHEMBL221171",
          "CHEMBL221333",
          "CHEMBL221392",
          "CHEMBL221483",
          "CHEMBL222368",
          "CHEMBL222672",
          "CHEMBL222673",
          "CHEMBL223433",
          "CHEMBL223618",
          "CHEMBL224061",
          "CHEMBL224191",
          "CHEMBL224562",
          "CHEMBL225234",
          "CHEMBL225498",
          "CHEMBL23154",
          "CHEMBL23265",
          "CHEMBL23318",
          "CHEMBL23319",
          "CHEMBL23419",
          "CHEMBL23475",
          "CHEMBL23487",
          "CHEMBL23582",
          "CHEMBL23722",
          "CHEMBL23818",
          "CHEMBL23918",
          "CHEMBL24172",
          "CHEMBL266769",
          "CHEMBL276317",
          "CHEMBL277177",
          "CHEMBL279544",
          "CHEMBL282034",
          "CHEMBL282036",
          "CHEMBL287749",
          "CHEMBL289755",
          "CHEMBL293335",
          "CHEMBL293559",
          "CHEMBL296172",
          "CHEMBL300444",
          "CHEMBL301452",
          "CHEMBL301898",
          "CHEMBL332131",
          "CHEMBL333736",
          "CHEMBL338886",
          "CHEMBL353159",
          "CHEMBL353619",
          "CHEMBL354285",
          "CHEMBL354639",
          "CHEMBL358651",
          "CHEMBL368801",
          "CHEMBL373645",
          "CHEMBL373648",
          "CHEMBL374119",
          "CHEMBL374237",
          "CHEMBL374335",
          "CHEMBL375007",
          "CHEMBL375415",
          "CHEMBL375539",
          "CHEMBL375574",
          "CHEMBL375651",
          "CHEMBL375788",
          "CHEMBL375807",
          "CHEMBL375932",
          "CHEMBL376404",
          "CHEMBL376643",
          "CHEMBL378988",
          "CHEMBL385117",
          "CHEMBL385122",
          "CHEMBL385124",
          "CHEMBL386941",
          "CHEMBL387736",
          "CHEMBL389501",
          "CHEMBL389728",
          "CHEMBL389940",
          "CHEMBL39537",
          "CHEMBL40323",
          "CHEMBL412711",
          "CHEMBL416578",
          "CHEMBL425113",
          "CHEMBL425640",
          "CHEMBL426546",
          "CHEMBL426708",
          "CHEMBL427094",
          "CHEMBL430593",
          "CHEMBL435310",
          "CHEMBL440702",
          "CHEMBL441306",
          "CHEMBL444747",
          "CHEMBL446960",
          "CHEMBL447022",
          "CHEMBL447043",
          "CHEMBL448946",
          "CHEMBL449889",
          "CHEMBL450824",
          "CHEMBL454487",
          "CHEMBL45511",
          "CHEMBL455981",
          "CHEMBL455989",
          "CHEMBL456107",
          "CHEMBL457030",
          "CHEMBL457031",
          "CHEMBL457212",
          "CHEMBL457235",
          "CHEMBL457422",
          "CHEMBL459336",
          "CHEMBL459543",
          "CHEMBL459544",
          "CHEMBL459962",
          "CHEMBL460599",
          "CHEMBL460608",
          "CHEMBL460609",
          "CHEMBL460610",
          "CHEMBL460828",
          "CHEMBL460829",
          "CHEMBL461244",
          "CHEMBL461245",
          "CHEMBL462054",
          "CHEMBL462096",
          "CHEMBL462097",
          "CHEMBL464333",
          "CHEMBL464597",
          "CHEMBL464798",
          "CHEMBL464799",
          "CHEMBL472712",
          "CHEMBL472713",
          "CHEMBL472716",
          "CHEMBL472902",
          "CHEMBL472903",
          "CHEMBL472904",
          "CHEMBL472918",
          "CHEMBL473309",
          "CHEMBL474738",
          "CHEMBL474939",
          "CHEMBL474940",
          "CHEMBL489084",
          "CHEMBL489085",
          "CHEMBL489086",
          "CHEMBL50",
          "CHEMBL503807",
          "CHEMBL505492",
          "CHEMBL507759",
          "CHEMBL508175",
          "CHEMBL508959",
          "CHEMBL509973",
          "CHEMBL510210",
          "CHEMBL512732",
          "CHEMBL514139",
          "CHEMBL514151",
          "CHEMBL514297",
          "CHEMBL515237",
          "CHEMBL515250",
          "CHEMBL515389",
          "CHEMBL51737",
          "CHEMBL522",
          "CHEMBL52312",
          "CHEMBL523765",
          "CHEMBL53515",
          "CHEMBL538902",
          "CHEMBL54157",
          "CHEMBL54302",
          "CHEMBL54927",
          "CHEMBL55325",
          "CHEMBL55602",
          "CHEMBL55707",
          "CHEMBL56097",
          "CHEMBL56134",
          "CHEMBL56363",
          "CHEMBL56649",
          "CHEMBL56750",
          "CHEMBL56823",
          "CHEMBL57299",
          "CHEMBL57403",
          "CHEMBL65135",
          "CHEMBL69728",
          "CHEMBL86304",
          "CHEMBL8706",
          "CHEMBL972",
          "CHEMBL99321"
        ],
        "number_of_missing_values": "0"
      },
      {
        "data_type": "numeric",
        "index": "1",
        "is_ignore": "false",
        "is_row_identifier": "false",
        "is_target": "false",
        "name": "FCFP4_1024b177",
        "number_of_missing_values": "0"
      },
      {
        "data_type": "numeric",
        "index": "2",
        "is_ignore": "false",
        "is_row_identifier": "false",
        "is_target": "false",
        "name": "FCFP4_1024b602",
        "number_of_missing_values": "0"
      },
      {
        "data_type": "numeric",
        "index": "3",
        "is_ignore": "false",
        "is_row_identifier": "false",
        "is_target": "false",
        "name": "FCFP4_1024b630",
        "number_of_missing_values": "0"
      },
      {
        "data_type": "numeric",
        "index": "4",
        "is_ignore": "false",
        "is_row_identifier": "false",
        "is_target": "false",
        "name": "FCFP4_1024b158",
        "number_of_missing_values": "0"
      },
      {
        "data_type": "numeric",
        "index": "5",
        "is_ignore": "false",
        "is_row_identifier": "false",
        "is_target": "false",
        "name": "FCFP4_1024b557",
        "number_of_missing_values": "0"
      },
      {
        "data_type": "numeric",
        "index": "6",
        "is_ignore": "false",
        "is_row_identifier": "false",
        "is_target": "false",
        "name": "FCFP4_1024b181",
        "number_of_missing_values": "0"
      },
      {
        "data_type": "numeric",
        "index": "7",
        "is_ignore": "false",
        "is_row_identifier": "false",
        "is_target": "false",
        "name": "FCFP4_1024b37",
        "number_of_missing_values": "0"
      },
      {
        "data_type": "numeric",
        "index": "8",
        "is_ignore": "false",
        "is_row_identifier": "false",
        "is_target": "false",
        "name": "FCFP4_1024b182",
        "number_of_missing_values": "0"
      },
      {
        "data_type": "numeric",
        "index": "9",
        "is_ignore": "false",
        "is_row_identifier": "false",
        "is_target": "false",
        "name": "FCFP4_1024b69",
        "number_of_missing_values": "0"
      },
      {
        "data_type": "numeric",
        "index": "10",
        "is_ignore": "false",
        "is_row_identifier": "false",
        "is_target": "false",
        "name": "FCFP4_1024b614",
        "number_of_missing_values": "0"
      },
      {
        "data_type": "numeric",
        "index": "11",
        "is_ignore": "false",
        "is_row_identifier": "false",
        "is_target": "false",
        "name": "FCFP4_1024b10",
        "number_of_missing_values": "0"
      },
      {
        "data_type": "numeric",
        "index": "12",
        "is_ignore": "false",
        "is_row_identifier": "false",
        "is_target": "false",
        "name": "FCFP4_1024b644",
        "number_of_missing_values": "0"
      },
      {
        "data_type": "numeric",
        "index": "13",
        "is_ignore": "false",
        "is_row_identifier": "false",
        "is_target": "false",
        "name": "FCFP4_1024b986",
        "number_of_missing_values": "0"
      },
      {
        "data_type": "numeric",
        "index": "14",
        "is_ignore": "false",
        "is_row_identifier": "false",
        "is_target": "false",
        "name": "FCFP4_1024b44",
        "number_of_missing_values": "0"
      },
      {
        "data_type": "numeric",
        "index": "15",
        "is_ignore": "false",
        "is_row_identifier": "false",
        "is_target": "false",
        "name": "FCFP4_1024b363",
        "number_of_missing_values": "0"
      },
      {
        "data_type": "numeric",
        "index": "16",
        "is_ignore": "false",
        "is_row_identifier": "false",
        "is_target": "false",
        "name": "FCFP4_1024b731",
        "number_of_missing_values": "0"
      },
      {
        "data_type": "numeric",
        "index": "17",
        "is_ignore": "false",
        "is_row_identifier": "false",
        "is_target": "false",
        "name": "FCFP4_1024b116",
        "number_of_missing_values": "0"
      },
      {
        "data_type": "numeric",
        "index": "18",
        "is_ignore": "false",
        "is_row_identifier": "false",
        "is_target": "false",
        "name": "FCFP4_1024b650",
        "number_of_missing_values": "0"
      },
      {
        "data_type": "numeric",
        "index": "19",
        "is_ignore": "false",
        "is_row_identifier": "false",
        "is_target": "false",
        "name": "FCFP4_1024b904",
        "number_of_missing_values": "0"
      },
      {
        "data_type": "numeric",
        "index": "20",
        "is_ignore": "false",
        "is_row_identifier": "false",
        "is_target": "false",
        "name": "FCFP4_1024b925",
        "number_of_missing_values": "0"
      },
      {
        "data_type": "numeric",
        "index": "21",
        "is_ignore": "false",
        "is_row_identifier": "false",
        "is_target": "false",
        "name": "FCFP4_1024b58",
        "number_of_missing_values": "0"
      },
      {
        "data_type": "numeric",
        "index": "22",
        "is_ignore": "false",
        "is_row_identifier": "false",
        "is_target": "false",
        "name": "FCFP4_1024b298",
        "number_of_missing_values": "0"
      },
      {
        "data_type": "numeric",
        "index": "23",
        "is_ignore": "false",
        "is_row_identifier": "false",
        "is_target": "false",
        "name": "FCFP4_1024b374",
        "number_of_missing_values": "0"
      },
      {
        "data_type": "numeric",
        "index": "24",
        "is_ignore": "false",
        "is_row_identifier": "false",
        "is_target": "false",
        "name": "FCFP4_1024b847",
        "number_of_missing_values": "0"
      },
      {
        "data_type": "numeric",
        "index": "25",
        "is_ignore": "false",
        "is_row_identifier": "false",
        "is_target": "false",
        "name": "FCFP4_1024b161",
        "number_of_missing_values": "0"
      },
      {
        "data_type": "numeric",
        "index": "26",
        "is_ignore": "false",
        "is_row_identifier": "false",
        "is_target": "false",
        "name": "FCFP4_1024b32",
        "number_of_missing_values": "0"
      },
      {
        "data_type": "numeric",
        "index": "27",
        "is_ignore": "false",
        "is_row_identifier": "false",
        "is_target": "false",
        "name": "FCFP4_1024b66",
        "number_of_missing_values": "0"
      },
      {
        "data_type": "numeric",
        "index": "28",
        "is_ignore": "false",
        "is_row_identifier": "false",
        "is_target": "false",
        "name": "FCFP4_1024b22",
        "number_of_missing_values": "0"
      },
      {
        "data_type": "numeric",
        "index": "29",
        "is_ignore": "false",
        "is_row_identifier": "false",
        "is_target": "false",
        "name": "FCFP4_1024b860",
        "number_of_missing_values": "0"
      },
      {
        "data_type": "numeric",
        "index": "30",
        "is_ignore": "false",
        "is_row_identifier": "false",
        "is_target": "false",
        "name": "FCFP4_1024b113",
        "number_of_missing_values": "0"
      },
      {
        "data_type": "numeric",
        "index": "31",
        "is_ignore": "false",
        "is_row_identifier": "false",
        "is_target": "false",
        "name": "FCFP4_1024b397",
        "number_of_missing_values": "0"
      },
      {
        "data_type": "numeric",
        "index": "32",
        "is_ignore": "false",
        "is_row_identifier": "false",
        "is_target": "false",
        "name": "FCFP4_1024b867",
        "number_of_missing_values": "0"
      },
      {
        "data_type": "numeric",
        "index": "33",
        "is_ignore": "false",
        "is_row_identifier": "false",
        "is_target": "false",
        "name": "FCFP4_1024b271",
        "number_of_missing_values": "0"
      },
      {
        "data_type": "numeric",
        "index": "34",
        "is_ignore": "false",
        "is_row_identifier": "false",
        "is_target": "false",
        "name": "FCFP4_1024b635",
        "number_of_missing_values": "0"
      },
      {
        "data_type": "numeric",
        "index": "35",
        "is_ignore": "false",
        "is_row_identifier": "false",
        "is_target": "false",
        "name": "FCFP4_1024b852",
        "number_of_missing_values": "0"
      },
      {
        "data_type": "numeric",
        "index": "36",
        "is_ignore": "false",
        "is_row_identifier": "false",
        "is_target": "false",
        "name": "FCFP4_1024b75",
        "number_of_missing_values": "0"
      },
      {
        "data_type": "numeric",
        "index": "37",
        "is_ignore": "false",
        "is_row_identifier": "false",
        "is_target": "false",
        "name": "FCFP4_1024b706",
        "number_of_missing_values": "0"
      },
      {
        "data_type": "numeric",
        "index": "38",
        "is_ignore": "false",
        "is_row_identifier": "false",
        "is_target": "false",
        "name": "FCFP4_1024b204",
        "number_of_missing_values": "0"
      },
      {
        "data_type": "numeric",
        "index": "39",
        "is_ignore": "false",
        "is_row_identifier": "false",
        "is_target": "false",
        "name": "FCFP4_1024b478",
        "number_of_missing_values": "0"
      },
      {
        "data_type": "numeric",
        "index": "40",
        "is_ignore": "false",
        "is_row_identifier": "false",
        "is_target": "false",
        "name": "FCFP4_1024b73",
        "number_of_missing_values": "0"
      },
      {
        "data_type": "numeric",
        "index": "41",
        "is_ignore": "false",
        "is_row_identifier": "false",
        "is_target": "false",
        "name": "FCFP4_1024b460",
        "number_of_missing_values": "0"
      },
      {
        "data_type": "numeric",
        "index": "42",
        "is_ignore": "false",
        "is_row_identifier": "false",
        "is_target": "false",
        "name": "FCFP4_1024b173",
        "number_of_missing_values": "0"
      },
      {
        "data_type": "numeric",
        "index": "43",
        "is_ignore": "false",
        "is_row_identifier": "false",
        "is_target": "false",
        "name": "FCFP4_1024b399",
        "number_of_missing_values": "0"
      },
      {
        "data_type": "numeric",
        "index": "44",
        "is_ignore": "false",
        "is_row_identifier": "false",
        "is_target": "false",
        "name": "FCFP4_1024b148",
        "number_of_missing_values": "0"
      },
      {
        "data_type": "numeric",
        "index": "45",
        "is_ignore": "false",
        "is_row_identifier": "false",
        "is_target": "false",
        "name": "FCFP4_1024b938",
        "number_of_missing_values": "0"
      },
      {
        "data_type": "numeric",
        "index": "46",
        "is_ignore": "false",
        "is_row_identifier": "false",
        "is_target": "false",
        "name": "FCFP4_1024b65",
        "number_of_missing_values": "0"
      },
      {
        "data_type": "numeric",
        "index": "47",
        "is_ignore": "false",
        "is_row_identifier": "false",
        "is_target": "false",
        "name": "FCFP4_1024b2",
        "number_of_missing_values": "0"
      },
      {
        "data_type": "numeric",
        "index": "48",
        "is_ignore": "false",
        "is_row_identifier": "false",
        "is_target": "false",
        "name": "FCFP4_1024b574",
        "number_of_missing_values": "0"
      },
      {
        "data_type": "numeric",
        "index": "49",
        "is_ignore": "false",
        "is_row_identifier": "false",
        "is_target": "false",
        "name": "FCFP4_1024b804",
        "number_of_missing_values": "0"
      },
      {
        "data_type": "numeric",
        "index": "50",
        "is_ignore": "false",
        "is_row_identifier": "false",
        "is_target": "false",
        "name": "FCFP4_1024b256",
        "number_of_missing_values": "0"
      },
      {
        "data_type": "numeric",
        "index": "51",
        "is_ignore": "false",
        "is_row_identifier": "false",
        "is_target": "false",
        "name": "FCFP4_1024b985",
        "number_of_missing_values": "0"
      },
      {
        "data_type": "numeric",
        "index": "52",
        "is_ignore": "false",
        "is_row_identifier": "false",
        "is_target": "true",
        "name": "pXC50",
        "number_of_missing_values": "0"
      }
    ]
  }
}