"molecule_id","AMW","C.","H.","Me","Mi","Mp","Mv","MW","N.","nAB","nAT","nB","nBM","nBO","nBR","nBT","nC","nCL","nCsp","nCsp2","nCsp3","nDB","nF","nH","nHet","nHM","nI","nN","nO","nP","nS","nSK","nTB","nX","O.","RBF","RBN","SCBO","Se","Si","Sp","Sv","X.","pXC50"
{1 8.58,2 42.9,3 38.1,4 1.04,5 1.119,6 0.66,7 0.665,8 180.17,10 6,11 21,13 8,14 13,16 21,17 9,20 9,22 2,24 8,25 4,29 4,32 13,35 19,36 0.095,37 2,38 18,39 21.844,40 23.498,41 13.864,42 13.966,44 5.523}
{0 CHEMBL151,1 9.234,2 48.4,3 32.3,4 1.045,5 1.107,6 0.695,7 0.707,8 286.25,10 12,11 31,13 14,14 23,16 33,17 15,20 15,22 2,24 10,25 6,29 6,32 21,35 19.4,36 0.03,37 1,38 31,39 32.382,40 34.332,41 21.534,42 21.923,44 5.495}
{0 CHEMBL17815,1 7.664,2 44.4,3 46.7,4 1.001,5 1.114,6 0.68,7 0.639,8 344.86,10 16,11 45,13 16,14 26,16 47,17 20,18 1,20 14,21 6,24 21,25 4,26 1,29 3,32 24,34 1,35 6.7,36 0.106,37 5,38 34,39 45.025,40 50.139,41 30.597,42 28.767,43 2.2,44 4.523}
{0 CHEMBL1926825,1 9.617,2 44.2,3 34.9,4 1.025,5 1.108,6 0.737,7 0.708,8 413.51,9 7,10 16,11 43,13 19,14 31,16 46,17 19,20 17,21 2,22 3,24 15,25 9,26 2,28 3,29 4,31 2,32 28,35 9.3,36 0.087,37 4,38 42,39 44.069,40 47.664,41 31.699,42 30.458,44 4.47}
{0 CHEMBL1926826,1 9.617,2 44.2,3 34.9,4 1.025,5 1.108,6 0.737,7 0.708,8 413.51,9 7,10 16,11 43,13 19,14 31,16 46,17 19,20 17,21 2,22 3,24 15,25 9,26 2,28 3,29 4,31 2,32 28,35 9.3,36 0.087,37 4,38 42,39 44.069,40 47.664,41 31.699,42 30.458,44 4}
{0 CHEMBL1929524,1 10.099,2 48.6,3 31.4,4 1.018,5 1.098,6 0.779,7 0.742,8 353.45,9 8.6,10 16,11 35,13 19,14 27,16 38,17 17,20 17,22 3,24 11,25 7,26 2,28 3,29 2,31 2,32 24,35 5.7,36 0.053,37 2,38 38,39 35.647,40 38.415,41 27.267,42 25.975,44 4.46}
{0 CHEMBL193416,1 7.204,2 41.7,3 47.2,4 1.004,5 1.124,6 0.652,7 0.622,8 259.33,9 2.8,10 6,11 36,13 8,14 21,16 38,17 15,20 9,21 6,22 2,24 17,25 4,28 1,29 3,32 19,35 8.3,36 0.053,37 2,38 26,39 36.153,40 40.448,41 23.46,42 22.38,44 4.432}
{0 CHEMBL1934604,1 6.602,2 40.7,3 51.9,4 0.994,5 1.123,6 0.638,7 0.597,8 356.5,10 12,11 54,13 13,14 27,16 55,17 22,20 13,21 9,22 1,24 28,25 4,29 4,32 26,35 7.4,36 0.182,37 10,38 34,39 53.68,40 60.65,41 34.478,42 32.234,44 4.88}
{0 CHEMBL193856,1 8.886,2 50,3 37.5,4 1.011,5 1.095,6 0.737,7 0.703,8 284.35,10 12,11 32,13 16,14 21,16 33,17 16,19 2,20 13,21 1,22 3,24 12,25 4,26 1,29 3,31 1,32 20,33 1,35 9.4,36 0.061,37 2,38 32,39 32.36,40 35.039,41 23.58,42 22.492,44 5}
{0 CHEMBL194273,1 10.067,2 48.6,3 31.4,4 1.051,5 1.128,6 0.719,7 0.719,8 352.35,10 12,11 35,13 16,14 25,16 36,17 17,19 2,20 13,21 2,22 3,23 3,24 11,25 7,26 1,29 3,31 1,32 24,33 1,34 3,35 8.6,36 0.056,37 2,38 36,39 36.782,40 39.474,41 25.154,42 25.169,43 8.6,44 5}
{0 CHEMBL194297,1 9.102,2 48.5,3 36.4,4 1.021,5 1.098,6 0.728,7 0.703,8 300.35,10 12,11 33,13 16,14 22,16 34,17 16,19 2,20 13,21 1,22 3,24 12,25 5,26 1,29 4,31 1,32 21,33 1,35 12.1,36 0.059,37 2,38 33,39 33.687,40 36.249,41 24.034,42 23.207,44 6.509}
{0 CHEMBL194298,1 8.733,2 47.2,3 38.9,4 1.016,5 1.102,6 0.717,7 0.687,8 314.38,10 12,11 36,13 16,14 23,16 37,17 17,19 2,20 13,21 2,22 3,24 14,25 5,26 1,29 4,31 1,32 22,33 1,35 11.1,36 0.081,37 3,38 34,39 36.571,40 39.664,41 25.796,42 24.734,44 5.023}
{0 CHEMBL194450,1 6.878,2 39.5,3 50,4 1.001,5 1.128,6 0.637,7 0.603,8 261.35,9 2.6,10 6,11 38,13 8,14 20,16 39,17 15,20 9,21 6,22 2,24 19,25 4,28 1,29 3,32 19,35 7.9,36 0.154,37 6,38 25,39 38.036,40 42.863,41 24.222,42 22.907,44 4.229}
{0 CHEMBL194891,1 8.51,2 43.2,3 40.9,4 1.023,5 1.112,6 0.687,7 0.664,8 374.44,10 12,11 44,13 16,14 27,16 45,17 19,19 2,20 13,21 4,22 3,24 18,25 7,26 1,29 6,31 1,32 26,33 1,35 13.6,36 0.111,37 5,38 38,39 44.993,40 48.913,41 30.227,42 29.217,44 5.078}
{0 CHEMBL194897,1 8.525,2 48.6,3 40,4 1.007,5 1.099,6 0.724,7 0.686,8 298.38,10 12,11 35,13 16,14 22,16 36,17 17,19 2,20 13,21 2,22 3,24 14,25 4,26 1,29 3,31 1,32 21,33 1,35 8.6,36 0.056,37 2,38 33,39 35.244,40 38.455,41 25.341,42 24.019,44 5}
{0 CHEMBL194961,1 7.066,2 40,3 48.6,4 1.004,5 1.127,6 0.642,7 0.611,8 247.32,9 2.9,10 6,11 35,13 8,14 19,16 36,17 14,20 9,21 5,22 2,24 17,25 4,28 1,29 3,32 18,35 8.6,36 0.111,37 4,38 24,39 35.153,40 39.448,41 22.46,42 21.38,44 4.328}
{0 CHEMBL195020,1 8.046,2 44.4,3 40.7,4 1.019,5 1.119,6 0.673,7 0.659,8 217.24,9 3.7,10 6,11 27,13 8,14 18,16 29,17 12,20 9,21 3,22 2,24 11,25 4,28 1,29 3,32 16,35 11.1,38 23,39 27.502,40 30.203,41 18.176,42 17.8,44 4.377}
{0 CHEMBL196052,1 7.815,2 47.2,3 41.7,4 1.007,5 1.112,6 0.686,7 0.663,8 281.33,9 2.8,10 12,11 36,13 14,14 23,16 38,17 17,20 15,21 2,22 2,24 15,25 4,28 1,29 3,32 21,35 8.3,36 0.105,37 4,38 31,39 36.269,40 40.033,41 24.699,42 23.853,44 4.357}
{0 CHEMBL196084,1 8.929,2 45.9,3 37.8,4 1.024,5 1.105,6 0.709,7 0.688,8 330.38,10 12,11 37,13 16,14 24,16 38,17 17,19 2,20 13,21 2,22 3,24 14,25 6,26 1,29 5,31 1,32 23,33 1,35 13.5,36 0.079,37 3,38 35,39 37.898,40 40.873,41 26.25,42 25.449,44 5}
{0 CHEMBL196156,1 7.573,2 46.2,3 43.6,4 1.004,5 1.114,6 0.678,7 0.651,8 295.36,9 2.6,10 12,11 39,13 14,14 24,16 41,17 18,20 15,21 3,22 2,24 17,25 4,28 1,29 3,32 22,35 7.7,36 0.122,37 5,38 32,39 39.153,40 43.448,41 26.46,42 25.38,44 4.387}
{0 CHEMBL196527,1 7.561,2 41.4,3 44.8,4 1.013,5 1.125,6 0.653,7 0.632,8 219.26,9 3.4,10 6,11 29,13 8,14 17,16 30,17 12,20 9,21 3,22 2,24 13,25 4,28 1,29 3,32 16,35 10.3,36 0.1,37 3,38 22,39 29.385,40 32.618,41 18.938,42 18.327,44 4.284}
{0 CHEMBL197190,1 6.255,2 37.7,3 54.7,4 0.99,5 1.131,6 0.623,7 0.576,8 331.5,9 1.9,10 6,11 53,13 8,14 25,16 54,17 20,20 9,21 11,22 2,24 29,25 4,28 1,29 3,32 24,35 5.7,36 0.185,37 10,38 30,39 52.454,40 59.939,41 33.029,42 30.541,44 4.886}
{0 CHEMBL197573,1 10.01,2 50,3 31.3,4 1.043,5 1.116,6 0.733,7 0.727,8 320.33,10 12,11 32,13 16,14 23,16 33,17 16,19 2,20 13,21 1,22 3,23 2,24 10,25 6,26 1,29 3,31 1,32 22,33 1,34 2,35 9.4,36 0.061,37 2,38 34,39 33.385,40 35.719,41 23.455,42 23.259,43 6.3,44 5.495}
{0 CHEMBL203459,1 8.61,2 45,3 40,4 1.02,5 1.107,6 0.7,7 0.674,8 344.41,10 12,11 40,13 16,14 25,16 41,17 18,19 2,20 13,21 3,22 3,24 16,25 6,26 1,29 5,31 1,32 24,33 1,35 12.5,36 0.098,37 4,38 36,39 40.782,40 44.289,41 28.011,42 26.976,44 5}
{0 CHEMBL203489,1 9.687,2 47.1,3 32.4,4 1.036,5 1.104,6 0.727,7 0.718,8 329.35,9 2.9,10 12,11 34,13 18,14 24,16 35,17 16,19 2,20 13,21 1,22 5,24 11,25 7,26 1,28 1,29 5,31 1,32 23,33 1,35 14.7,36 0.086,37 3,38 37,39 35.233,40 37.541,41 24.733,42 24.417,44 5}
{0 CHEMBL204130,1 7.738,2 45.5,3 45.5,4 0.998,5 1.107,6 0.696,7 0.65,8 340.47,10 12,11 44,13 16,14 25,16 45,17 20,19 2,20 13,21 5,22 3,24 20,25 4,26 1,29 3,31 1,32 24,33 1,35 6.8,36 0.111,37 5,38 36,39 43.894,40 48.7,41 30.625,42 28.6,44 5}
{0 CHEMBL204203,1 8.8,2 52.6,3 36.8,4 1.006,5 1.091,6 0.746,7 0.711,8 334.41,10 17,11 38,13 21,14 26,16 40,17 20,19 2,20 17,21 1,22 3,24 14,25 4,26 1,29 3,31 1,32 24,33 1,35 7.9,36 0.05,37 2,38 39.5,39 38.244,40 41.455,41 28.341,42 27.019,44 5}
{0 CHEMBL204293,1 9.832,2 46.4,3 32.1,4 1.036,5 1.104,6 0.733,7 0.721,8 275.3,9 3.6,10 11,11 28,13 15,14 20,16 29,17 13,19 2,20 10,21 1,22 3,24 9,25 6,26 1,28 1,29 4,31 1,32 19,33 1,35 14.3,36 0.069,37 2,38 30.5,39 29.022,40 30.917,41 20.517,42 20.175,44 5}
{0 CHEMBL204551,1 7.294,2 39.6,3 49.1,4 0.997,5 1.123,6 0.663,7 0.617,8 386.56,9 3.8,10 11,11 53,13 13,14 29,16 55,17 21,20 12,21 9,22 2,24 26,25 6,26 1,28 2,29 3,31 1,32 27,35 5.7,36 0.109,37 6,38 36.5,39 52.865,40 59.527,41 35.159,42 32.696,44 4.456}
{0 CHEMBL204769,1 7.962,2 46.3,3 43.9,4 1,5 1.105,6 0.704,7 0.66,8 326.44,10 12,11 41,13 16,14 24,16 42,17 19,19 2,20 13,21 4,22 3,24 18,25 4,26 1,29 3,31 1,32 23,33 1,35 7.3,36 0.071,37 3,38 35,39 41.011,40 45.285,41 28.864,42 27.073,44 6.444}
{0 CHEMBL204795,1 9.01,2 47.4,3 36.8,4 1.024,5 1.102,6 0.717,7 0.696,8 342.39,10 12,11 38,13 17,14 25,16 39,17 18,19 2,20 14,21 2,22 4,24 14,25 6,26 1,29 5,31 1,32 24,33 1,35 13.2,36 0.103,37 4,38 37,39 38.898,40 41.873,41 27.25,42 26.449,44 5.301}
{0 CHEMBL204796,1 9.459,2 48.3,3 34.5,4 1.028,5 1.098,6 0.734,7 0.713,8 274.31,10 11,11 29,13 15,14 20,16 30,17 14,19 2,20 11,21 1,22 3,24 10,25 5,26 1,29 4,31 1,32 19,33 1,35 13.8,36 0.067,37 2,38 30.5,39 29.804,40 31.834,41 21.273,42 20.68,44 5}
{0 CHEMBL204865,1 9.538,2 44.7,3 36.8,4 1.026,5 1.1,6 0.734,7 0.701,8 362.45,10 12,11 38,13 18,14 25,16 39,17 17,19 2,20 13,21 2,22 5,24 14,25 7,26 2,29 5,31 2,32 24,33 1,35 13.2,36 0.077,37 3,38 38,39 38.975,40 41.793,41 27.898,42 26.636,44 5}
{0 CHEMBL205080,1 8.677,2 50,3 38.1,4 1.011,5 1.097,6 0.728,7 0.697,8 364.44,10 17,11 42,13 21,14 28,16 44,17 21,19 2,20 17,21 2,22 3,24 16,25 5,26 1,29 4,31 1,32 26,33 1,35 9.5,36 0.068,37 3,38 41.5,39 42.454,40 46.079,41 30.557,42 29.261,44 6.523}
{0 CHEMBL205120,1 9.179,2 47.2,3 38.9,4 1.009,5 1.094,6 0.75,7 0.7,8 330.45,10 12,11 36,13 16,14 23,16 37,17 17,19 2,20 13,21 2,22 3,24 14,25 5,26 2,29 3,31 2,32 22,33 1,35 8.3,36 0.081,37 3,38 34,39 36.32,40 39.375,41 26.989,42 25.206,44 6.444}
{0 CHEMBL205131,1 7.962,2 46.3,3 43.9,4 1,5 1.105,6 0.704,7 0.66,8 326.44,10 12,11 41,13 16,14 24,16 42,17 19,19 2,20 13,21 4,22 3,24 18,25 4,26 1,29 3,31 1,32 23,33 1,35 7.3,36 0.095,37 4,38 35,39 41.011,40 45.285,41 28.864,42 27.073,44 5.495}
{0 CHEMBL2206368,1 8.113,2 47.9,3 39.6,4 1.014,5 1.11,6 0.69,7 0.674,8 389.43,9 2.1,10 22,11 48,13 23,14 32,16 51,17 23,20 20,21 3,22 1,24 19,25 6,28 1,29 5,32 29,35 10.4,36 0.118,37 6,38 44,39 48.691,40 53.282,41 33.131,42 32.337,44 4.233}
{0 CHEMBL228463,1 6.528,2 42.6,3 51.9,4 0.988,5 1.119,6 0.649,7 0.602,8 352.51,10 12,11 54,13 14,14 27,16 55,17 23,20 15,21 8,22 2,24 28,25 3,29 3,32 26,35 5.6,36 0.091,37 5,38 35,39 53.352,40 60.441,41 35.023,42 32.52,44 4.187}
{0 CHEMBL237949,1 8.759,2 47.5,3 35,4 1.029,5 1.113,6 0.696,7 0.694,8 350.35,9 5,10 17,11 40,13 21,14 29,16 43,17 19,20 17,21 2,22 4,24 14,25 7,28 2,29 5,32 26,35 12.5,36 0.07,37 3,38 41.5,39 41.142,40 44.535,41 27.852,42 27.778,44 4.509}
{0 CHEMBL237950,1 8.09,2 42.9,3 40.8,4 1.023,5 1.122,6 0.665,7 0.655,8 396.43,9 4.1,10 17,11 49,13 21,14 31,16 51,17 21,20 17,21 4,22 4,24 20,25 8,28 2,29 6,32 29,35 12.2,36 0.118,37 6,38 43.5,39 50.12,40 54.99,41 32.591,42 32.073,44 4.377}
{0 CHEMBL238171,1 8.818,2 45.2,3 35.7,4 1.037,5 1.126,6 0.68,7 0.683,8 370.36,9 4.8,10 17,11 42,13 21,14 29,16 44,17 19,20 17,21 2,22 4,23 1,24 15,25 8,28 2,29 5,32 27,34 1,35 11.9,36 0.091,37 4,38 41.5,39 43.538,40 47.29,41 28.551,42 28.688,43 2.4,44 4.071}
{0 CHEMBL258735,1 9.671,2 47.4,3 34.2,4 1.014,5 1.101,6 0.764,7 0.724,8 367.48,9 7.9,10 16,11 38,13 19,14 28,16 41,17 18,20 17,21 1,22 3,24 13,25 7,26 2,28 3,29 2,31 2,32 25,35 5.3,36 0.073,37 3,38 39,39 38.531,40 41.83,41 29.029,42 27.502,44 4.55}
{0 CHEMBL259883,1 10.099,2 48.6,3 31.4,4 1.018,5 1.098,6 0.779,7 0.742,8 353.45,9 8.6,10 16,11 35,13 19,14 27,16 38,17 17,20 17,22 3,24 11,25 7,26 2,28 3,29 2,31 2,32 24,35 5.7,36 0.053,37 2,38 38,39 35.647,40 38.415,41 27.267,42 25.975,44 4.44}
{0 CHEMBL259902,1 10.938,2 50,3 29.4,4 1.019,5 1.093,6 0.814,7 0.767,8 371.89,9 8.8,10 16,11 34,13 19,14 27,16 37,17 17,18 1,20 17,22 3,24 10,25 7,26 3,28 3,29 1,31 2,32 24,34 1,35 2.9,36 0.054,37 2,38 38,39 34.644,40 37.149,41 27.671,42 26.088,43 2.9,44 4.301}
{0 CHEMBL260059,1 10.624,2 47.2,3 27.8,4 1.033,5 1.103,6 0.777,7 0.755,8 382.45,9 11.1,10 16,11 36,13 21,14 29,16 39,17 17,20 17,22 5,24 10,25 9,26 2,28 4,29 3,31 2,32 26,35 8.3,36 0.077,37 3,38 42,39 37.193,40 39.707,41 27.966,42 27.185,44 4.45}
{0 CHEMBL260063,1 9.925,2 50,3 32.4,4 1.009,5 1.094,6 0.789,7 0.743,8 337.45,9 8.8,10 16,11 34,13 19,14 26,16 37,17 17,20 17,22 3,24 11,25 6,26 2,28 3,29 1,31 2,32 23,35 2.9,36 0.054,37 2,38 37,39 34.32,40 37.205,41 26.813,42 25.26,44 4}
{0 CHEMBL260125,1 10.099,2 48.6,3 31.4,4 1.018,5 1.098,6 0.779,7 0.742,8 353.45,9 8.6,10 16,11 35,13 19,14 27,16 38,17 17,20 17,22 3,24 11,25 7,26 2,28 3,29 2,31 2,32 24,35 5.7,36 0.053,37 2,38 38,39 35.647,40 38.415,41 27.267,42 25.975,44 4.752}
{0 CHEMBL260886,1 9.833,2 46.2,3 33.3,4 1.022,5 1.104,6 0.756,7 0.724,8 383.48,9 7.7,10 16,11 39,13 19,14 29,16 42,17 18,20 17,21 1,22 3,24 13,25 8,26 2,28 3,29 3,31 2,32 26,35 7.7,36 0.071,37 3,38 40,39 39.858,40 43.039,41 29.483,42 28.217,44 4.47}
{0 CHEMBL261267,1 10.624,2 47.2,3 27.8,4 1.033,5 1.103,6 0.777,7 0.755,8 382.45,9 11.1,10 16,11 36,13 21,14 29,16 39,17 17,20 17,22 5,24 10,25 9,26 2,28 4,29 3,31 2,32 26,35 8.3,36 0.077,37 3,38 42,39 37.193,40 39.707,41 27.966,42 27.185,44 4.1}
{0 CHEMBL261268,1 10.938,2 50,3 29.4,4 1.019,5 1.093,6 0.814,7 0.767,8 371.89,9 8.8,10 16,11 34,13 19,14 27,16 37,17 17,18 1,20 17,22 3,24 10,25 7,26 3,28 3,29 1,31 2,32 24,34 1,35 2.9,36 0.054,37 2,38 38,39 34.644,40 37.149,41 27.671,42 26.088,43 2.9,44 4.45}
{0 CHEMBL263119,1 9.833,2 46.2,3 33.3,4 1.022,5 1.104,6 0.756,7 0.724,8 383.48,9 7.7,10 16,11 39,13 19,14 29,16 42,17 18,20 17,21 1,22 3,24 13,25 8,26 2,28 3,29 3,31 2,32 26,35 7.7,36 0.071,37 3,38 40,39 39.858,40 43.039,41 29.483,42 28.217,44 4.45}
{0 CHEMBL263909,1 10.938,2 50,3 29.4,4 1.019,5 1.093,6 0.814,7 0.767,8 371.89,9 8.8,10 16,11 34,13 19,14 27,16 37,17 17,18 1,20 17,22 3,24 10,25 7,26 3,28 3,29 1,31 2,32 24,34 1,35 2.9,36 0.054,37 2,38 38,39 34.644,40 37.149,41 27.671,42 26.088,43 2.9,44 4.55}
{0 CHEMBL264164,1 10.938,2 50,3 29.4,4 1.019,5 1.093,6 0.814,7 0.767,8 371.89,9 8.8,10 16,11 34,13 19,14 27,16 37,17 17,18 1,20 17,22 3,24 10,25 7,26 3,28 3,29 1,31 2,32 24,34 1,35 2.9,36 0.054,37 2,38 38,39 34.644,40 37.149,41 27.671,42 26.088,43 2.9,44 4.361}
{0 CHEMBL267476,1 5.394,2 34.6,3 61.5,4 0.977,5 1.136,6 0.598,7 0.536,8 280.5,11 52,13 3,14 19,16 51,17 18,20 5,21 13,22 3,24 32,25 2,29 2,32 20,35 3.8,36 0.275,37 14,38 22,39 50.792,40 59.062,41 31.091,42 27.858,44 4.923}
{0 CHEMBL272443,1 11.08,2 43.3,3 26.7,4 1.044,5 1.11,6 0.773,7 0.755,8 332.39,9 13.3,10 11,11 30,13 16,14 24,16 32,17 13,20 13,22 5,24 8,25 9,26 2,28 4,29 3,31 2,32 22,35 10,36 0.094,37 3,38 34.5,39 31.309,40 33.292,41 23.205,42 22.658,44 4.05}
{0 CHEMBL27918,1 5.428,2 32.7,3 61.8,4 0.982,5 1.14,6 0.587,7 0.529,8 298.52,11 55,13 1,14 21,16 55,17 18,20 1,21 17,22 1,24 34,25 3,29 3,32 21,35 5.5,36 0.273,37 15,38 22,39 54.003,40 62.687,41 32.307,42 29.1,44 4}
{0 CHEMBL281291,1 5.594,2 34,3 60.4,4 0.983,5 1.137,6 0.595,7 0.539,8 296.5,11 53,13 2,14 21,16 53,17 18,20 3,21 15,22 2,24 32,25 3,29 3,32 21,35 5.7,36 0.264,37 14,38 23,39 52.12,40 60.271,41 31.546,42 28.573,44 4}
{0 CHEMBL281921,1 5.428,2 32.7,3 61.8,4 0.982,5 1.14,6 0.587,7 0.529,8 298.52,11 55,13 1,14 21,16 55,17 18,20 1,21 17,22 1,24 34,25 3,29 3,32 21,35 5.5,36 0.273,37 15,38 22,39 54.003,40 62.687,41 32.307,42 29.1,44 4}
{0 CHEMBL283482,1 5.898,2 34,3 60.4,4 0.979,5 1.132,6 0.618,7 0.548,8 312.57,11 53,13 2,14 21,16 53,17 18,20 3,21 15,22 2,24 32,25 3,26 1,29 2,31 1,32 21,35 3.8,36 0.264,37 14,38 23,39 51.869,40 59.982,41 32.739,42 29.046,44 5.699}
{0 CHEMBL28484,1 5.594,2 34,3 60.4,4 0.983,5 1.137,6 0.595,7 0.539,8 296.5,11 53,13 2,14 21,16 53,17 18,20 3,21 15,22 2,24 32,25 3,29 3,32 21,35 5.7,36 0.264,37 14,38 23,39 52.12,40 60.271,41 31.546,42 28.573,44 4}
{0 CHEMBL28539,1 5.72,2 32.7,3 61.8,4 0.977,5 1.134,6 0.609,7 0.538,8 314.59,11 55,13 1,14 21,16 55,17 18,20 1,21 17,22 1,24 34,25 3,26 1,29 2,31 1,32 21,35 3.6,36 0.273,37 15,38 22,39 53.752,40 62.397,41 33.501,42 29.572,44 4}
{0 CHEMBL28901,1 5.72,2 32.7,3 61.8,4 0.977,5 1.134,6 0.609,7 0.538,8 314.59,11 55,13 1,14 21,16 55,17 18,20 1,21 17,22 1,24 34,25 3,26 1,29 2,31 1,32 21,35 3.6,36 0.273,37 15,38 22,39 53.752,40 62.397,41 33.501,42 29.572,44 5.398}
{0 CHEMBL28925,1 5.898,2 34,3 60.4,4 0.979,5 1.132,6 0.618,7 0.548,8 312.57,11 53,13 2,14 21,16 53,17 18,20 3,21 15,22 2,24 32,25 3,26 1,29 2,31 1,32 21,35 3.8,36 0.264,37 14,38 23,39 51.869,40 59.982,41 32.739,42 29.046,44 4}
{0 CHEMBL314941,1 8.438,2 40.9,3 45.5,4 1.015,5 1.12,6 0.68,7 0.643,8 371.28,10 12,11 44,13 12,14 25,16 45,17 18,18 2,20 12,21 6,24 20,25 6,26 2,29 4,32 24,34 2,35 9.1,36 0.111,37 5,38 31,39 44.676,40 49.293,41 29.909,42 28.309,43 4.5,44 7.187}
{0 CHEMBL316139,1 6.733,2 40.4,3 51.1,4 0.998,5 1.124,6 0.637,7 0.6,8 316.43,10 12,11 47,13 12,14 24,16 48,17 19,20 12,21 7,24 24,25 4,29 4,32 23,35 8.5,36 0.125,37 6,38 30,39 46.912,40 52.82,41 29.955,42 28.181,44 6.77}
{0 CHEMBL33778,1 5.714,2 36.1,3 59,4 0.982,5 1.133,6 0.608,7 0.551,8 348.58,10 6,11 61,13 7,14 25,16 61,17 22,20 7,21 15,22 1,24 36,25 3,29 3,32 25,35 4.9,36 0.246,37 15,38 29,39 59.887,40 69.102,41 37.069,42 33.627,44 4.178}
{0 CHEMBL362923,1 9.375,2 51.5,3 33.3,4 1.018,5 1.095,6 0.752,7 0.727,8 309.36,9 3,10 12,11 33,13 17,14 23,16 34,17 17,19 3,20 13,21 1,22 3,24 11,25 5,26 1,28 1,29 3,31 1,32 22,33 2,35 9.1,36 0.059,37 2,38 36,39 33.578,40 36.123,41 24.824,42 23.987,44 5.495}
{0 CHEMBL364739,1 9.102,2 48.5,3 36.4,4 1.021,5 1.098,6 0.728,7 0.703,8 300.35,10 12,11 33,13 16,14 22,16 34,17 16,19 2,20 13,21 1,22 3,24 12,25 5,26 1,29 4,31 1,32 21,33 1,35 12.1,36 0.059,37 2,38 33,39 33.687,40 36.249,41 24.034,42 23.207,44 6.412}
{0 CHEMBL364885,1 7.438,2 40,3 45.7,4 1.011,5 1.129,6 0.649,7 0.625,8 260.32,9 5.7,10 6,11 35,13 8,14 21,16 37,17 14,20 9,21 5,22 2,24 16,25 5,28 2,29 3,32 19,35 8.6,36 0.054,37 2,38 26,39 35.371,40 39.531,41 22.705,42 21.875,44 4}
{0 CHEMBL371191,1 8.733,2 47.2,3 38.9,4 1.016,5 1.102,6 0.717,7 0.687,8 314.38,10 12,11 36,13 16,14 23,16 37,17 17,19 2,20 13,21 2,22 3,24 14,25 5,26 1,29 4,31 1,32 22,33 1,35 11.1,36 0.081,37 3,38 34,39 36.571,40 39.664,41 25.796,42 24.734,44 5.228}
{0 CHEMBL372548,1 8.929,2 45.9,3 37.8,4 1.024,5 1.105,6 0.709,7 0.688,8 330.38,10 12,11 37,13 16,14 24,16 38,17 17,19 2,20 13,21 2,22 3,24 14,25 6,26 1,29 5,31 1,32 23,33 1,35 13.5,36 0.079,37 3,38 35,39 37.898,40 40.873,41 26.25,42 25.449,44 5}
{0 CHEMBL375476,1 7.898,2 48.1,3 40.7,4 1.006,5 1.111,6 0.693,7 0.67,8 213.25,9 3.7,10 11,11 27,13 13,14 17,16 28,17 13,20 13,22 2,24 11,25 3,28 1,29 2,32 16,35 7.4,36 0.107,37 3,38 24.5,39 27.174,40 29.993,41 18.722,42 18.085,44 4.155}
{0 CHEMBL393607,1 8.24,2 40.4,3 40.4,4 1.029,5 1.137,6 0.655,7 0.65,8 428.46,9 7.7,10 17,11 52,13 20,14 34,16 55,17 21,20 15,21 6,22 3,23 1,24 21,25 10,28 4,29 5,32 31,34 1,35 9.6,36 0.091,37 5,38 45.5,39 53.509,40 59.117,41 34.085,42 33.784,43 1.9,44 4.155}
{0 CHEMBL397358,1 8.39,2 45.2,3 38.1,4 1.024,5 1.118,6 0.681,7 0.674,8 352.37,9 4.8,10 17,11 42,13 21,14 28,16 44,17 19,20 17,21 2,22 4,24 16,25 7,28 2,29 5,32 26,35 11.9,36 0.091,37 4,38 40.5,39 43.025,40 46.95,41 28.614,42 28.304,44 6}
{0 CHEMBL407151,1 10.624,2 47.2,3 27.8,4 1.033,5 1.103,6 0.777,7 0.755,8 382.45,9 11.1,10 16,11 36,13 21,14 29,16 39,17 17,20 17,22 5,24 10,25 9,26 2,28 4,29 3,31 2,32 26,35 8.3,36 0.077,37 3,38 42,39 37.193,40 39.707,41 27.966,42 27.185,44 4.523}
{0 CHEMBL407152,1 10.624,2 47.2,3 27.8,4 1.033,5 1.103,6 0.777,7 0.755,8 382.45,9 11.1,10 16,11 36,13 21,14 29,16 39,17 17,20 17,22 5,24 10,25 9,26 2,28 4,29 3,31 2,32 26,35 8.3,36 0.077,37 3,38 42,39 37.193,40 39.707,41 27.966,42 27.185,44 4.377}
{0 CHEMBL409276,1 10.624,2 47.2,3 27.8,4 1.033,5 1.103,6 0.777,7 0.755,8 382.45,9 11.1,10 16,11 36,13 21,14 29,16 39,17 17,20 17,22 5,24 10,25 9,26 2,28 4,29 3,31 2,32 26,35 8.3,36 0.077,37 3,38 42,39 37.193,40 39.707,41 27.966,42 27.185,44 4.3}
{0 CHEMBL409741,1 10.938,2 50,3 29.4,4 1.019,5 1.093,6 0.814,7 0.767,8 371.89,9 8.8,10 16,11 34,13 19,14 27,16 37,17 17,18 1,20 17,22 3,24 10,25 7,26 3,28 3,29 1,31 2,32 24,34 1,35 2.9,36 0.054,37 2,38 38,39 34.644,40 37.149,41 27.671,42 26.088,43 2.9,44 4.149}
{0 CHEMBL410649,1 10.624,2 47.2,3 27.8,4 1.033,5 1.103,6 0.777,7 0.755,8 382.45,9 11.1,10 16,11 36,13 21,14 29,16 39,17 17,20 17,22 5,24 10,25 9,26 2,28 4,29 3,31 2,32 26,35 8.3,36 0.077,37 3,38 42,39 37.193,40 39.707,41 27.966,42 27.185,44 4.437}
{0 CHEMBL412064,1 10.938,2 50,3 29.4,4 1.019,5 1.093,6 0.814,7 0.767,8 371.89,9 8.8,10 16,11 34,13 19,14 27,16 37,17 17,18 1,20 17,22 3,24 10,25 7,26 3,28 3,29 1,31 2,32 24,34 1,35 2.9,36 0.054,37 2,38 38,39 34.644,40 37.149,41 27.671,42 26.088,43 2.9,44 4}
{0 CHEMBL418973,1 5.942,2 35.6,3 57.6,4 0.989,5 1.134,6 0.606,7 0.556,8 350.55,10 6,11 59,13 7,14 25,16 59,17 21,20 7,21 14,22 1,24 34,25 4,29 4,32 25,35 6.8,36 0.254,37 15,38 29,39 58.33,40 66.896,41 35.762,42 32.815,44 4.256}
{0 CHEMBL426488,1 9.687,2 47.1,3 32.4,4 1.036,5 1.104,6 0.727,7 0.718,8 329.35,9 2.9,10 12,11 34,13 18,14 24,16 35,17 16,19 2,20 13,21 1,22 5,24 11,25 7,26 1,28 1,29 5,31 1,32 23,33 1,35 14.7,36 0.086,37 3,38 37,39 35.233,40 37.541,41 24.733,42 24.417,44 5.456}
{0 CHEMBL427356,1 9.448,2 50,3 34.4,4 1.027,5 1.106,6 0.735,7 0.715,8 302.34,10 12,11 32,13 16,14 22,16 33,17 16,19 2,20 13,21 1,22 3,23 1,24 11,25 5,26 1,29 3,31 1,32 21,33 1,34 1,35 9.4,36 0.061,37 2,38 33,39 32.873,40 35.379,41 23.517,42 22.876,43 3.1,44 5}
{0 CHEMBL436670,1 10.104,2 42.4,3 33.3,4 1.03,5 1.11,6 0.749,7 0.718,8 333.42,9 9.1,10 11,11 33,13 14,14 24,16 35,17 14,20 13,21 1,22 3,24 11,25 8,26 2,28 3,29 3,31 2,32 22,35 9.1,36 0.086,37 3,38 32.5,39 33.975,40 36.624,41 24.722,42 23.69,44 4.002}
{0 CHEMBL436935,1 7.397,2 38.7,3 48.4,4 1.005,5 1.125,6 0.655,7 0.616,8 458.63,9 3.2,10 11,11 62,13 14,14 34,16 64,17 24,20 13,21 11,22 3,24 30,25 8,26 1,28 2,29 5,31 1,32 32,35 8.1,36 0.141,37 9,38 42.5,39 62.287,40 69.776,41 40.591,42 38.179,44 4.319}
{0 CHEMBL445177,1 5.874,2 37.3,3 57.6,4 0.983,5 1.13,6 0.615,7 0.561,8 346.56,10 6,11 59,13 8,14 25,16 59,17 22,20 9,21 13,22 2,24 34,25 3,29 3,32 25,35 5.1,36 0.237,37 14,38 30,39 58.003,40 66.687,41 36.307,42 33.1,44 4.301}
{0 CHEMBL459603,1 5.934,2 39.6,3 56.6,4 0.979,5 1.125,6 0.629,7 0.572,8 314.51,10 6,11 53,13 9,14 23,16 53,17 21,20 12,21 9,22 3,24 30,25 2,29 2,32 23,35 3.8,36 0.226,37 12,38 29,39 51.909,40 59.647,41 33.33,42 30.332,44 4.222}
{0 CHEMBL470264,1 5.874,2 37.3,3 57.6,4 0.983,5 1.13,6 0.615,7 0.561,8 346.56,10 6,11 59,13 8,14 25,16 59,17 22,20 9,21 13,22 2,24 34,25 3,29 3,32 25,35 5.1,36 0.237,37 14,38 30,39 58.003,40 66.687,41 36.307,42 33.1,44 5.222}
{0 CHEMBL470680,1 5.741,2 40.4,3 57.7,4 0.973,5 1.124,6 0.632,7 0.57,8 298.51,10 6,11 52,13 9,14 22,16 52,17 21,20 12,21 9,22 3,24 30,25 1,29 1,32 22,35 1.9,36 0.231,37 12,38 28,39 50.581,40 58.437,41 32.876,42 29.617,44 4}
{0 CHEMBL51628,1 9.008,2 50,3 33.3,4 1.035,5 1.104,6 0.703,7 0.707,8 162.15,10 6,11 18,13 8,14 13,16 19,17 9,20 9,22 2,24 6,25 3,29 3,32 12,35 16.7,38 18,39 18.633,40 19.874,41 12.648,42 12.725,44 4.367}
{0 CHEMBL52,1 6.873,2 40.9,3 50,4 1.001,5 1.123,6 0.641,7 0.606,8 302.4,10 12,11 44,13 12,14 23,16 45,17 18,20 12,21 6,24 22,25 4,29 4,32 22,35 9.1,36 0.111,37 5,38 29,39 44.029,40 49.405,41 28.193,42 26.654,44 5.456}
{0 CHEMBL594396,1 5.909,2 30.5,3 61,4 0.988,5 1.14,6 0.596,7 0.534,8 348.61,11 59,13 3,14 22,16 58,17 18,20 2,21 16,22 3,24 36,25 5,26 1,29 4,31 1,32 23,35 6.8,36 0.293,37 17,38 25,39 58.29,40 67.231,41 35.171,42 31.529,44 6.155}
{0 CHEMBL8659,1 5.232,2 33.3,3 63,4 0.975,5 1.138,6 0.59,7 0.526,8 282.52,11 54,13 2,14 19,16 53,17 18,20 3,21 15,22 2,24 34,25 2,29 2,32 20,35 3.7,36 0.283,37 15,38 21,39 52.676,40 61.477,41 31.853,42 28.385,44 4.658}
{0 CHEMBL88952,1 6.715,2 41.2,3 51,4 0.996,5 1.122,6 0.641,7 0.602,8 342.47,10 12,11 51,13 12,14 27,16 53,17 21,20 12,21 9,24 26,25 4,29 4,32 25,35 7.8,36 0.094,37 5,38 33,39 50.796,40 57.235,41 32.716,42 30.708,44 6.854}
{0 CHEMBL89283,1 10.459,2 40.9,3 45.5,4 1.011,5 1.116,6 0.702,7 0.652,8 460.18,10 12,11 44,13 12,14 25,15 2,16 45,17 18,20 12,21 6,24 20,25 6,26 2,29 4,32 24,34 2,35 9.1,36 0.111,37 5,38 31,39 44.487,40 49.088,41 30.898,42 28.704,43 4.5,44 7.244}
{0 CHEMBL91531,1 6.609,2 40,3 52,4 0.996,5 1.125,6 0.634,7 0.594,8 330.46,10 12,11 50,13 12,14 25,16 51,17 20,20 12,21 8,24 26,25 4,29 4,32 24,35 8,36 0.137,37 7,38 31,39 49.796,40 56.235,41 31.716,42 29.708,44 5.509}
{0 CHEMBL92212,1 6.402,2 39.3,3 53.6,4 0.992,5 1.126,6 0.629,7 0.585,8 358.52,10 12,11 56,13 12,14 27,16 57,17 22,20 12,21 10,24 30,25 4,29 4,32 26,35 7.1,36 0.123,37 7,38 33,39 55.563,40 63.066,41 35.239,42 32.761,44 6.854}
