{
  "data_set_description": {
    "collection_date": "November 2013",
    "creator": "Dr Jeremy Besnard, Dr Ivan Olier, Dr Noureddin Sadawi, Dr Larisa Soldatova, Dr Crina Grosan, Prof Ross King, Dr Richard Bickerton, Prof Andrew Hopkins and Dr Willem van Hoorn",
    "default_target_attribute": "pXC50",
    "description": "This dataset contains QSAR data (from ChEMBL version 17) showing activity values (unit is pseudo-pCI50) of several compounds on drug target ChEMBL_ID: CHEMBL1681620 (TID: 103913), and it has 41 rows and 1167 features (not including molecule IDs and class feature: molecule_id and pXC50). The features represent Molecular Descriptors which were generated from SMILES strings. Missing value imputation was applied to this dataset (By choosing the Median).",
    "description_version": "1",
    "file_id": "3611334",
    "format": "ARFF",
    "id": "37359",
    "licence": "Public",
    "md5_checksum": "0967545c1f0120c787f2ee71f38184d3",
    "minio_url": "https://data.openml.org/datasets/0003/37359/dataset_37359.pq",
    "name": "QSAR-DATASET-FOR-DRUG-TARGET-CHEMBL1681620",
    "original_data_url": "https://www.ebi.ac.uk/chembl/target/inspect/CHEMBL1681620",
    "parquet_url": "https://data.openml.org/datasets/0003/37359/dataset_37359.pq",
    "processing_date": "2018-10-04 05:23:14",
    "row_id_attribute": "molecule_id",
    "status": "deactivated",
    "tag": [
      "MetaQSAR",
      "study_13"
    ],
    "upload_date": "2016-07-16T00:22:25",
    "url": "https://api.openml.org/data/v1/download/3611334/QSAR-DATASET-FOR-DRUG-TARGET-CHEMBL1681620.arff",
    "version": "11",
    "visibility": "public"
  }
}