"molecule_id","O.","nO","nHet","Me","H.","AMW","C.","Mi","Mp","Mv","MW","pXC50"
{1 5.4,2 2,3 8,4 1.015,5 45.9,6 7.984,7 32.4,8 1.144,9 0.653,10 0.619,11 295.41,12 7.585}
{0 CHEMBL1195586,1 5.4,2 2,3 8,4 1.015,5 45.9,6 7.984,7 32.4,8 1.144,9 0.653,10 0.619,11 295.41,12 9}
{0 CHEMBL1240542,1 2.6,2 1,3 6,4 1.001,5 48.7,6 7.01,7 35.9,8 1.144,9 0.636,10 0.603,11 273.38,12 8.523}
{0 CHEMBL1241349,1 2.6,2 1,3 6,4 1.001,5 50,6 6.878,7 34.2,8 1.148,9 0.627,10 0.592,11 261.37,12 8.495}
{0 CHEMBL1241380,1 2.6,2 1,3 6,4 1.001,5 48.7,6 7.01,7 35.9,8 1.144,9 0.636,10 0.603,11 273.38,12 8.678}
{0 CHEMBL1241381,1 2.8,2 1,3 6,4 1.004,5 47.2,6 7.204,7 36.1,8 1.144,9 0.64,10 0.611,11 259.35,12 8.495}
{0 CHEMBL1241431,1 2.9,2 1,3 6,4 1.007,5 44.1,6 7.569,7 38.2,8 1.14,9 0.656,10 0.631,11 257.33,12 7.509}
{0 CHEMBL1241432,1 2.6,2 1,3 6,4 1.001,5 50,6 6.878,7 34.2,8 1.148,9 0.627,10 0.592,11 261.37,12 7.469}
{0 CHEMBL1243249,1 2.3,2 1,3 6,4 0.995,5 52.3,6 6.578,7 34.1,8 1.146,9 0.621,10 0.581,11 289.43,12 9.179}
{0 CHEMBL1243250,1 2.3,2 1,3 6,4 0.995,5 52.3,6 6.578,7 34.1,8 1.146,9 0.621,10 0.581,11 289.43,12 8.77}
{0 CHEMBL1243278,1 2,2 1,3 6,4 0.991,5 54,6 6.35,7 34,8 1.145,9 0.617,10 0.572,11 317.49,12 7.745}
{0 CHEMBL1243279,1 2.2,2 1,3 6,4 0.995,5 51.1,6 6.699,7 35.6,8 1.143,9 0.63,10 0.59,11 301.44,12 8.585}
{0 CHEMBL1243280,1 2,2 1,3 6,4 0.991,5 52.9,6 6.461,7 35.3,8 1.143,9 0.625,10 0.581,11 329.5,12 7.854}
{0 CHEMBL1243311,1 2.4,2 1,3 6,4 1.001,5 45.2,6 7.367,7 40.5,8 1.134,9 0.662,10 0.631,11 309.41,12 8.097}
{0 CHEMBL1243312,1 2.6,2 1,3 9,4 1.018,5 42.1,6 7.904,7 34.2,8 1.154,9 0.646,10 0.631,11 300.37,12 7.229}
{0 CHEMBL1243341,1 1.8,2 1,3 7,4 0.993,5 49.1,6 7.229,7 38.2,8 1.131,9 0.664,10 0.615,11 397.6,12 7.149}
{0 CHEMBL188034,1 2.1,2 1,3 7,4 0.997,5 47.9,6 7.449,7 37.5,8 1.132,9 0.666,10 0.62,11 357.53,12 8.824}
{0 CHEMBL188375,1 2.6,2 1,3 7,4 1.003,5 48.7,6 7.524,7 33.3,8 1.142,9 0.653,10 0.608,11 293.44,12 8.77}
{0 CHEMBL189837,1 4.9,2 2,3 7,4 1.006,5 51.2,6 6.814,7 31.7,8 1.152,9 0.61,10 0.579,11 279.39,12 7.854}
{0 CHEMBL189910,1 3.9,2 2,3 7,4 1,5 49,6 6.97,7 37.3,8 1.138,9 0.638,10 0.604,11 355.49,12 7.224}
{0 CHEMBL189911,1 2.3,2 1,3 6,4 0.995,5 53.5,6 6.452,7 32.6,8 1.15,9 0.612,10 0.571,11 277.42,12 7.658}
{0 CHEMBL190139,1 2.1,2 1,3 8,4 1.002,5 46.8,6 7.628,7 36.2,8 1.137,9 0.664,10 0.622,11 358.52,12 8.699}
{0 CHEMBL190216,1 2.1,2 1,3 8,4 1.008,5 45.8,6 7.823,7 37.5,8 1.14,9 0.665,10 0.628,11 375.52,12 9.444}
{0 CHEMBL190587,1 1.9,2 1,3 6,4 0.992,5 50.9,6 6.67,7 37.7,8 1.137,9 0.639,10 0.597,11 353.52,12 5.699}
{0 CHEMBL190867,1 1.9,2 1,3 7,4 0.991,5 53.7,6 6.733,7 33.3,8 1.141,9 0.635,10 0.58,11 363.59,12 9.276}
{0 CHEMBL190954,1 2.1,2 1,3 8,4 1.002,5 45.8,6 7.719,7 37.5,8 1.134,9 0.671,10 0.63,11 370.53,12 7.26}
{0 CHEMBL191177,1 2.1,2 1,3 8,4 1.004,5 45.8,6 8.166,7 37.5,8 1.131,9 0.684,10 0.637,11 391.97,12 8.699}
{0 CHEMBL191281,1 2.1,2 1,3 7,4 0.995,5 53.2,6 6.883,7 31.9,8 1.144,9 0.633,10 0.58,11 323.52,12 9.316}
{0 CHEMBL191436,1 2,2 1,3 7,4 0.997,5 46.9,6 7.542,7 38.8,8 1.13,9 0.673,10 0.628,11 369.54,12 8.854}
{0 CHEMBL191544,1 2.3,2 1,3 7,4 0.997,5 52.3,6 7.034,7 31.8,8 1.144,9 0.636,10 0.585,11 309.49,12 9.187}
{0 CHEMBL191810,1 9.5,2 4,3 9,4 1.027,5 40.5,6 8.176,7 38.1,8 1.139,9 0.653,10 0.646,11 343.38,12 4.921}
{0 CHEMBL191917,1 10.3,2 4,3 10,4 1.031,5 43.6,6 8.395,7 30.8,8 1.147,9 0.643,10 0.623,11 327.41,12 4.602}
{0 CHEMBL193413,1 7.3,2 3,3 10,4 1.027,5 39,6 8.791,7 36.6,8 1.137,9 0.679,10 0.661,11 360.44,12 5.284}
{0 CHEMBL193417,1 7.1,2 3,3 9,4 1.021,5 40.5,6 8.558,7 38.1,8 1.132,9 0.681,10 0.657,11 359.45,12 5.523}
{0 CHEMBL193467,1 6.4,2 3,3 10,4 1.018,5 42.6,6 8.266,7 36.2,8 1.137,9 0.668,10 0.641,11 388.5,12 4.991}
{0 CHEMBL193481,1 8.7,2 4,3 10,4 1.023,5 41.3,6 8.467,7 37,8 1.134,9 0.67,10 0.649,11 389.48,12 5.155}
{0 CHEMBL193561,1 6.7,2 3,3 9,4 1.017,5 42.2,6 8.3,7 37.8,8 1.132,9 0.675,10 0.647,11 373.48,12 5.337}
{0 CHEMBL193573,1 6.8,2 3,3 8,4 1.015,5 43.2,6 7.759,7 38.6,8 1.137,9 0.653,10 0.635,11 341.41,12 5.886}
{0 CHEMBL193587,1 7.7,2 3,3 11,4 1.033,5 38.5,6 8.959,7 33.3,8 1.146,9 0.669,10 0.656,11 349.42,12 5.046}
{0 CHEMBL193611,1 6.7,2 3,3 12,4 1.051,5 35.6,6 9.499,7 37.8,8 1.155,9 0.671,10 0.673,11 427.45,12 5.77}
{0 CHEMBL193736,1 6.7,2 3,3 9,4 1.017,5 42.2,6 8.3,7 37.8,8 1.132,9 0.675,10 0.647,11 373.48,12 5.699}
{0 CHEMBL193960,1 6.4,2 3,3 9,4 1.011,5 48.9,6 7.521,7 31.9,8 1.144,9 0.636,10 0.6,11 353.5,12 5.553}
{0 CHEMBL194119,1 7,2 3,3 9,4 1.021,5 41.9,6 7.963,7 37.2,8 1.142,9 0.65,10 0.638,11 342.4,12 5.071}
{0 CHEMBL194736,1 5.6,2 2,3 9,4 1.021,5 44.4,6 8.233,7 30.6,8 1.15,9 0.65,10 0.622,11 296.4,12 4.523}
{0 CHEMBL194942,1 6.3,2 3,3 9,4 1.011,5 47.9,6 7.615,7 33.3,8 1.141,9 0.644,10 0.608,11 365.51,12 5.456}
{0 CHEMBL195193,1 6.8,2 3,3 9,4 1.014,5 47.7,6 7.715,7 31.8,8 1.145,9 0.639,10 0.606,11 339.47,12 5.398}
{0 CHEMBL195430,1 6.4,2 3,3 9,4 1.011,5 48.9,6 7.521,7 31.9,8 1.144,9 0.636,10 0.6,11 353.5,12 5.301}
{0 CHEMBL195652,1 6.4,2 3,3 10,4 1.021,5 38.3,6 8.734,7 40.4,8 1.128,9 0.694,10 0.673,11 410.5,12 5.161}
{0 CHEMBL195660,1 7.9,2 3,3 9,4 1.023,5 44.7,6 8.195,7 31.6,8 1.146,9 0.648,10 0.621,11 311.41,12 5.745}
{0 CHEMBL196562,1 6.7,2 3,3 9,4 1.014,5 46.7,6 7.811,7 33.3,8 1.141,9 0.647,10 0.615,11 351.48,12 5.495}
{0 CHEMBL196595,1 6.7,2 3,3 9,4 1.017,5 42.2,6 8.3,7 37.8,8 1.132,9 0.675,10 0.647,11 373.48,12 5.824}
{0 CHEMBL196596,1 7.3,2 3,3 10,4 1.027,5 39,6 8.791,7 36.6,8 1.137,9 0.679,10 0.661,11 360.44,12 6.056}
{0 CHEMBL2070307,1 2.9,2 1,3 7,4 1.006,5 48.6,6 7.64,7 31.4,8 1.146,9 0.649,10 0.605,11 267.4,12 7.921}
{0 CHEMBL2070308,1 2.9,2 1,3 7,4 1.006,5 48.6,6 7.64,7 31.4,8 1.146,9 0.649,10 0.605,11 267.4,12 8.357}
{0 CHEMBL2070309,1 2.9,2 1,3 7,4 1.006,5 48.6,6 7.64,7 31.4,8 1.146,9 0.649,10 0.605,11 267.4,12 7.469}
{0 CHEMBL2070310,1 2.6,2 1,3 7,4 1.003,5 50,6 7.406,7 31.6,8 1.145,9 0.644,10 0.597,11 281.43,12 8}
{0 CHEMBL2070311,1 5.1,2 2,3 8,4 1.011,5 48.7,6 7.626,7 30.8,8 1.147,9 0.639,10 0.6,11 297.43,12 8.284}
{0 CHEMBL2070312,1 5.1,2 2,3 8,4 1.011,5 48.7,6 7.626,7 30.8,8 1.147,9 0.639,10 0.6,11 297.43,12 7.06}
{0 CHEMBL2070400,1 5.1,2 2,3 8,4 1.011,5 48.7,6 7.626,7 30.8,8 1.147,9 0.639,10 0.6,11 297.43,12 7.06}
{0 CHEMBL2070401,1 5.1,2 2,3 8,4 1.011,5 48.7,6 7.626,7 30.8,8 1.147,9 0.639,10 0.6,11 297.43,12 7.469}
{0 CHEMBL2070402,1 5.1,2 2,3 8,4 1.011,5 48.7,6 7.626,7 30.8,8 1.147,9 0.639,10 0.6,11 297.43,12 7.469}
{0 CHEMBL2070403,1 2.9,2 1,3 7,4 1.006,5 48.6,6 7.64,7 31.4,8 1.146,9 0.649,10 0.605,11 267.4,12 6.22}
{0 CHEMBL2070404,1 4.8,2 2,3 8,4 1.007,5 50,6 7.416,7 31,8 1.146,9 0.635,10 0.594,11 311.46,12 7.469}
{0 CHEMBL2070405,1 4.4,2 2,3 8,4 1.004,5 51.1,6 7.233,7 31.1,8 1.146,9 0.632,10 0.588,11 325.49,12 7.921}
{0 CHEMBL2070406,1 4.4,2 2,3 8,4 1.004,5 51.1,6 7.233,7 31.1,8 1.146,9 0.632,10 0.588,11 325.49,12 6.979}
{0 CHEMBL2070407,1 4.8,2 2,3 8,4 1.007,5 50,6 7.416,7 31,8 1.146,9 0.635,10 0.594,11 311.46,12 6.434}
{0 CHEMBL2070408,1 5.1,2 2,3 8,4 1.011,5 48.7,6 7.626,7 30.8,8 1.147,9 0.639,10 0.6,11 297.43,12 6.886}
{0 CHEMBL277041,1 8.6,2 3,3 9,4 1.028,5 42.9,6 8.497,7 31.4,8 1.146,9 0.653,10 0.631,11 297.38,12 3.975}
{0 CHEMBL364298,1 5.9,2 2,3 8,4 1.019,5 44.1,6 8.276,7 32.4,8 1.144,9 0.659,10 0.628,11 281.38,12 5.509}
{0 CHEMBL365378,1 2,2 1,3 7,4 0.993,5 54,6 6.751,7 32,8 1.144,9 0.63,10 0.576,11 337.55,12 9.756}
{0 CHEMBL365813,1 2.1,2 1,3 8,4 1.004,5 45.8,6 8.166,7 37.5,8 1.131,9 0.684,10 0.637,11 391.97,12 9.444}
{0 CHEMBL370979,1 5.6,2 2,3 11,4 1.033,5 38.9,6 8.956,7 30.6,8 1.155,9 0.664,10 0.649,11 322.4,12 2.444}
{0 CHEMBL371325,1 7.9,2 3,3 11,4 1.034,5 36.8,6 9.644,7 34.2,8 1.135,9 0.704,10 0.678,11 366.47,12 5.469}
{0 CHEMBL372451,1 6.3,2 3,3 9,4 1.013,5 43.8,6 8.073,7 37.5,8 1.133,9 0.669,10 0.639,11 387.51,12 5.301}
{0 CHEMBL372859,1 6.7,2 3,3 9,4 1.017,5 42.2,6 8.3,7 37.8,8 1.132,9 0.675,10 0.647,11 373.48,12 5.252}
{0 CHEMBL383380,1 5.9,2 2,3 8,4 1.019,5 44.1,6 8.276,7 32.4,8 1.144,9 0.659,10 0.628,11 281.38,12 5.409}
{0 CHEMBL405346,1 2.6,2 1,3 7,4 1.003,5 48.7,6 7.524,7 33.3,8 1.142,9 0.653,10 0.608,11 293.44,12 10.046}
{0 CHEMBL405371,3 6,4 0.997,5 48.6,6 7.526,7 34.3,8 1.14,9 0.664,10 0.613,11 263.41,12 8.699}
{0 CHEMBL407216,1 2.6,2 1,3 7,4 1.003,5 48.7,6 7.524,7 33.3,8 1.142,9 0.653,10 0.608,11 293.44,12 6.854}
{0 CHEMBL425019,1 6.8,2 3,3 9,4 1.014,5 47.7,6 7.715,7 31.8,8 1.145,9 0.639,10 0.606,11 339.47,12 4.77}
{0 CHEMBL425188,1 2.1,2 1,3 7,4 0.995,5 53.2,6 6.883,7 31.9,8 1.144,9 0.633,10 0.58,11 323.52,12 8.886}
{0 CHEMBL427359,1 6.8,2 3,3 9,4 1.014,5 47.7,6 7.715,7 31.8,8 1.145,9 0.639,10 0.606,11 339.47,12 5.509}
{0 CHEMBL443485,1 9.7,2 3,3 8,4 1.033,5 41.9,6 8.106,7 32.3,8 1.154,9 0.627,10 0.624,11 251.28,12 5.222}
{0 CHEMBL542449,1 4.3,2 2,3 8,4 1.007,5 44.7,6 7.904,7 38.3,8 1.131,9 0.674,10 0.637,11 371.51,12 8.857}
{0 CHEMBL542452,1 5.1,2 2,3 7,4 1.009,5 48.7,6 7.112,7 33.3,8 1.149,9 0.622,10 0.595,11 277.37,12 7.357}
{0 CHEMBL542694,1 5,2 2,3 9,4 1.023,5 45,6 8.186,7 32.5,8 1.152,9 0.646,10 0.62,11 327.43,12 7.699}
{0 CHEMBL542697,1 7.3,2 3,3 9,4 1.018,5 46.3,6 7.938,7 31.7,8 1.145,9 0.643,10 0.613,11 325.44,12 7.553}
{0 CHEMBL544110,1 4.3,2 2,3 8,4 1.007,5 44.7,6 7.904,7 38.3,8 1.131,9 0.674,10 0.637,11 371.51,12 8.357}
{0 CHEMBL544574,1 8.1,2 3,3 8,4 1.021,5 45.9,6 7.55,7 32.4,8 1.152,9 0.621,10 0.606,11 279.34,12 6.873}
{0 CHEMBL544806,1 4.7,2 2,3 8,4 1.007,5 48.8,6 7.523,7 32.6,8 1.143,9 0.644,10 0.603,11 323.47,12 8.398}
{0 CHEMBL545042,1 4.5,2 2,3 8,4 1.01,5 43.2,6 8.125,7 38.6,8 1.13,9 0.68,10 0.646,11 357.48,12 8.444}
{0 CHEMBL545273,1 6.1,2 2,3 7,4 1.018,5 45.5,6 7.555,7 33.3,8 1.151,9 0.629,10 0.611,11 249.31,12 6.143}
{0 CHEMBL545740,1 4.5,2 2,3 9,4 1.021,5 40.9,6 8.533,7 38.6,8 1.138,9 0.678,10 0.654,11 375.47,12 8.447}
{0 CHEMBL552894,1 4.5,2 2,3 9,4 1.017,5 40.9,6 8.907,7 38.6,8 1.129,9 0.699,10 0.665,11 391.92,12 9.51}
{0 CHEMBL553375,1 4,2 2,3 8,4 1.006,5 42,6 8.151,7 42,8 1.123,9 0.694,10 0.659,11 407.54,12 7.046}
{0 CHEMBL553982,1 4.5,2 2,3 9,4 1.017,5 40.9,6 8.907,7 38.6,8 1.129,9 0.699,10 0.665,11 391.92,12 8.194}
{0 CHEMBL554322,1 5.4,2 2,3 8,4 1.015,5 45.9,6 7.984,7 32.4,8 1.144,9 0.653,10 0.619,11 295.41,12 7.585}
{0 CHEMBL554642,1 4.3,2 2,3 8,4 1.007,5 44.7,6 7.904,7 38.3,8 1.131,9 0.674,10 0.637,11 371.51,12 7.585}
{0 CHEMBL554896,1 5.4,2 2,3 8,4 1.015,5 45.9,6 7.984,7 32.4,8 1.144,9 0.653,10 0.619,11 295.41,12 8.921}
{0 CHEMBL554965,1 5,2 2,3 8,4 1.011,5 47.5,6 7.736,7 32.5,8 1.143,9 0.648,10 0.61,11 309.44,12 8.036}
{0 CHEMBL603295,1 8.6,2 3,3 9,4 1.028,5 42.9,6 8.497,7 31.4,8 1.146,9 0.653,10 0.631,11 297.38,12 5.301}
