{
  "data_features": {
    "feature": [
      {
        "data_type": "numeric",
        "index": "0",
        "is_ignore": "false",
        "is_row_identifier": "false",
        "is_target": "false",
        "name": "history",
        "number_of_missing_values": "0"
      },
      {
        "data_type": "string",
        "index": "1",
        "is_ignore": "false",
        "is_row_identifier": "false",
        "is_target": "false",
        "name": "session",
        "number_of_missing_values": "0"
      },
      {
        "data_type": "nominal",
        "index": "2",
        "is_ignore": "false",
        "is_row_identifier": "false",
        "is_target": "true",
        "name": "user",
        "nominal_value": [
          "USER0",
          "USER1",
          "USER2",
          "USER3",
          "USER4",
          "USER5",
          "USER6",
          "USER7",
          "USER8"
        ],
        "number_of_missing_values": "0"
      }
    ]
  }
}