{
  "data_set_description": {
    "collection_date": "November 2013",
    "creator": "Dr Jeremy Besnard, Dr Ivan Olier, Dr Noureddin Sadawi, Dr Larisa Soldatova, Dr Crina Grosan, Prof Ross King, Dr Richard Bickerton, Prof Andrew Hopkins and Dr Willem van Hoorn",
    "default_target_attribute": "pXC50",
    "description": "This dataset contains QSAR data (from ChEMBL version 17) showing activity values (unit is pseudo-pCI50) of several compounds on drug target ChEMBL_ID: CHEMBL4521 (TID: 100474), and it has 33 rows and 43 features (not including molecule IDs and class feature: molecule_id and pXC50). The features represent Basic Molecular Descriptors which were generated from SMILES strings.  Missing value imputation was applied to this dataset (By choosing the Median).",
    "description_version": "1",
    "file_id": "3607916",
    "format": "ARFF",
    "id": "37227",
    "licence": "Public",
    "md5_checksum": "c3a46aa92e2c37858645881285d6fcd9",
    "minio_url": "https://data.openml.org/datasets/0003/37227/dataset_37227.pq",
    "name": "QSAR-DATASET-FOR-DRUG-TARGET-CHEMBL4521",
    "original_data_url": "https://www.ebi.ac.uk/chembl/target/inspect/CHEMBL4521",
    "parquet_url": "https://data.openml.org/datasets/0003/37227/dataset_37227.pq",
    "processing_date": "2018-10-04 05:13:10",
    "row_id_attribute": "molecule_id",
    "status": "deactivated",
    "tag": [
      "MetaQSAR",
      "study_13"
    ],
    "upload_date": "2016-07-15T23:54:51",
    "url": "https://api.openml.org/data/v1/download/3607916/QSAR-DATASET-FOR-DRUG-TARGET-CHEMBL4521.arff",
    "version": "11",
    "visibility": "public"
  }
}