{
  "data_features": {
    "feature": [
      {
        "data_type": "nominal",
        "index": "0",
        "is_ignore": "false",
        "is_row_identifier": "true",
        "is_target": "false",
        "name": "molecule_id",
        "nominal_value": [
          "CHEMBL100121",
          "CHEMBL100176",
          "CHEMBL100346",
          "CHEMBL100347",
          "CHEMBL100389",
          "CHEMBL100440",
          "CHEMBL100832",
          "CHEMBL100909",
          "CHEMBL101391",
          "CHEMBL101554",
          "CHEMBL101915",
          "CHEMBL102017",
          "CHEMBL102126",
          "CHEMBL102178",
          "CHEMBL102429",
          "CHEMBL102430",
          "CHEMBL102491",
          "CHEMBL102753",
          "CHEMBL102974",
          "CHEMBL103150",
          "CHEMBL103278",
          "CHEMBL103553",
          "CHEMBL103559",
          "CHEMBL103588",
          "CHEMBL103796",
          "CHEMBL104115",
          "CHEMBL104177",
          "CHEMBL104178",
          "CHEMBL104425",
          "CHEMBL104478",
          "CHEMBL104998",
          "CHEMBL104999",
          "CHEMBL105000",
          "CHEMBL10579",
          "CHEMBL105913",
          "CHEMBL106040",
          "CHEMBL106265",
          "CHEMBL106346",
          "CHEMBL106520",
          "CHEMBL106740",
          "CHEMBL106906",
          "CHEMBL106986",
          "CHEMBL107116",
          "CHEMBL107414",
          "CHEMBL107446",
          "CHEMBL107571",
          "CHEMBL107637",
          "CHEMBL108178",
          "CHEMBL10873",
          "CHEMBL10895",
          "CHEMBL10906",
          "CHEMBL10913",
          "CHEMBL10937",
          "CHEMBL109494",
          "CHEMBL109687",
          "CHEMBL109691",
          "CHEMBL10984",
          "CHEMBL10995",
          "CHEMBL11000",
          "CHEMBL11002",
          "CHEMBL11027",
          "CHEMBL11033",
          "CHEMBL11036",
          "CHEMBL11037",
          "CHEMBL11048",
          "CHEMBL11049",
          "CHEMBL11054",
          "CHEMBL11077",
          "CHEMBL110979",
          "CHEMBL11104",
          "CHEMBL11120",
          "CHEMBL11127",
          "CHEMBL11141",
          "CHEMBL11146",
          "CHEMBL11154",
          "CHEMBL11163",
          "CHEMBL11173",
          "CHEMBL11177",
          "CHEMBL11206",
          "CHEMBL11220",
          "CHEMBL11240",
          "CHEMBL11271",
          "CHEMBL112756",
          "CHEMBL11288",
          "CHEMBL113",
          "CHEMBL11332",
          "CHEMBL11342",
          "CHEMBL113476",
          "CHEMBL11348",
          "CHEMBL113518",
          "CHEMBL11385",
          "CHEMBL11410",
          "CHEMBL11439",
          "CHEMBL11635",
          "CHEMBL11636",
          "CHEMBL118164",
          "CHEMBL118679",
          "CHEMBL119709",
          "CHEMBL120346",
          "CHEMBL120602",
          "CHEMBL120662",
          "CHEMBL121593",
          "CHEMBL121793",
          "CHEMBL133982",
          "CHEMBL139000",
          "CHEMBL142587",
          "CHEMBL144032",
          "CHEMBL144398",
          "CHEMBL144482",
          "CHEMBL144740",
          "CHEMBL144743",
          "CHEMBL144754",
          "CHEMBL144799",
          "CHEMBL144928",
          "CHEMBL145058",
          "CHEMBL145316",
          "CHEMBL145751",
          "CHEMBL145822",
          "CHEMBL146234",
          "CHEMBL146479",
          "CHEMBL146549",
          "CHEMBL147582",
          "CHEMBL147893",
          "CHEMBL147913",
          "CHEMBL148074",
          "CHEMBL148088",
          "CHEMBL148464",
          "CHEMBL148589",
          "CHEMBL149732",
          "CHEMBL152026",
          "CHEMBL152058",
          "CHEMBL152294",
          "CHEMBL152488",
          "CHEMBL157641",
          "CHEMBL157864",
          "CHEMBL158423",
          "CHEMBL158483",
          "CHEMBL158507",
          "CHEMBL158572",
          "CHEMBL158598",
          "CHEMBL158631",
          "CHEMBL158859",
          "CHEMBL158992",
          "CHEMBL159178",
          "CHEMBL159195",
          "CHEMBL16010",
          "CHEMBL161051",
          "CHEMBL161121",
          "CHEMBL161169",
          "CHEMBL161227",
          "CHEMBL161258",
          "CHEMBL161294",
          "CHEMBL161326",
          "CHEMBL161378",
          "CHEMBL161425",
          "CHEMBL161566",
          "CHEMBL161574",
          "CHEMBL161628",
          "CHEMBL161711",
          "CHEMBL161766",
          "CHEMBL161790",
          "CHEMBL161933",
          "CHEMBL161934",
          "CHEMBL16195",
          "CHEMBL161971",
          "CHEMBL162088",
          "CHEMBL16215",
          "CHEMBL162247",
          "CHEMBL16242",
          "CHEMBL162470",
          "CHEMBL162531",
          "CHEMBL16254",
          "CHEMBL162558",
          "CHEMBL162658",
          "CHEMBL162702",
          "CHEMBL162814",
          "CHEMBL162986",
          "CHEMBL16305",
          "CHEMBL163574",
          "CHEMBL16416",
          "CHEMBL164623",
          "CHEMBL16488",
          "CHEMBL16510",
          "CHEMBL16529",
          "CHEMBL16598",
          "CHEMBL16643",
          "CHEMBL16715",
          "CHEMBL16737",
          "CHEMBL16750",
          "CHEMBL16774",
          "CHEMBL16820",
          "CHEMBL16833",
          "CHEMBL17127",
          "CHEMBL183",
          "CHEMBL190",
          "CHEMBL1907708",
          "CHEMBL1907924",
          "CHEMBL19095",
          "CHEMBL19191",
          "CHEMBL19305",
          "CHEMBL193453",
          "CHEMBL193509",
          "CHEMBL193766",
          "CHEMBL194031",
          "CHEMBL194330",
          "CHEMBL194331",
          "CHEMBL194401",
          "CHEMBL194452",
          "CHEMBL194457",
          "CHEMBL194539",
          "CHEMBL194696",
          "CHEMBL194704",
          "CHEMBL194756",
          "CHEMBL194860",
          "CHEMBL194948",
          "CHEMBL194956",
          "CHEMBL194965",
          "CHEMBL19533",
          "CHEMBL195356",
          "CHEMBL195357",
          "CHEMBL195460",
          "CHEMBL195522",
          "CHEMBL196138",
          "CHEMBL196306",
          "CHEMBL196375",
          "CHEMBL196569",
          "CHEMBL196665",
          "CHEMBL197030",
          "CHEMBL197325",
          "CHEMBL197333",
          "CHEMBL197359",
          "CHEMBL197376",
          "CHEMBL19768",
          "CHEMBL198574",
          "CHEMBL198760",
          "CHEMBL198769",
          "CHEMBL198874",
          "CHEMBL19970",
          "CHEMBL200479",
          "CHEMBL200687",
          "CHEMBL200835",
          "CHEMBL209061",
          "CHEMBL209122",
          "CHEMBL209927",
          "CHEMBL209943",
          "CHEMBL210642",
          "CHEMBL2110165",
          "CHEMBL211183",
          "CHEMBL2112325",
          "CHEMBL2113388",
          "CHEMBL2113418",
          "CHEMBL2113575",
          "CHEMBL2113607",
          "CHEMBL2113608",
          "CHEMBL2113609",
          "CHEMBL2113640",
          "CHEMBL2113641",
          "CHEMBL2113642",
          "CHEMBL2113643",
          "CHEMBL211449",
          "CHEMBL211862",
          "CHEMBL212458",
          "CHEMBL212633",
          "CHEMBL223229",
          "CHEMBL223340",
          "CHEMBL223450",
          "CHEMBL223451",
          "CHEMBL223821",
          "CHEMBL223871",
          "CHEMBL224083",
          "CHEMBL224097",
          "CHEMBL224098",
          "CHEMBL224125",
          "CHEMBL224179",
          "CHEMBL224273",
          "CHEMBL224274",
          "CHEMBL224307",
          "CHEMBL224313",
          "CHEMBL224545",
          "CHEMBL224619",
          "CHEMBL224620",
          "CHEMBL224621",
          "CHEMBL224669",
          "CHEMBL224717",
          "CHEMBL224718",
          "CHEMBL224852",
          "CHEMBL224909",
          "CHEMBL224933",
          "CHEMBL225026",
          "CHEMBL225341",
          "CHEMBL225398",
          "CHEMBL225522",
          "CHEMBL225523",
          "CHEMBL226562",
          "CHEMBL226563",
          "CHEMBL226608",
          "CHEMBL226719",
          "CHEMBL226720",
          "CHEMBL226866",
          "CHEMBL226867",
          "CHEMBL226874",
          "CHEMBL227142",
          "CHEMBL227143",
          "CHEMBL227397",
          "CHEMBL227677",
          "CHEMBL227772",
          "CHEMBL227797",
          "CHEMBL227798",
          "CHEMBL227848",
          "CHEMBL227893",
          "CHEMBL227944",
          "CHEMBL227945",
          "CHEMBL228225",
          "CHEMBL2311146",
          "CHEMBL241987",
          "CHEMBL242202",
          "CHEMBL242203",
          "CHEMBL251798",
          "CHEMBL251799",
          "CHEMBL251997",
          "CHEMBL252198",
          "CHEMBL254063",
          "CHEMBL254064",
          "CHEMBL254065",
          "CHEMBL254270",
          "CHEMBL254271",
          "CHEMBL254481",
          "CHEMBL254482",
          "CHEMBL254483",
          "CHEMBL254691",
          "CHEMBL254692",
          "CHEMBL254693",
          "CHEMBL254896",
          "CHEMBL254897",
          "CHEMBL254898",
          "CHEMBL263819",
          "CHEMBL266161",
          "CHEMBL268026",
          "CHEMBL268071",
          "CHEMBL268590",
          "CHEMBL268701",
          "CHEMBL268963",
          "CHEMBL268964",
          "CHEMBL269112",
          "CHEMBL269218",
          "CHEMBL269633",
          "CHEMBL27041",
          "CHEMBL27047",
          "CHEMBL273094",
          "CHEMBL273267",
          "CHEMBL273295",
          "CHEMBL273370",
          "CHEMBL273508",
          "CHEMBL273578",
          "CHEMBL273657",
          "CHEMBL273671",
          "CHEMBL273953",
          "CHEMBL274267",
          "CHEMBL274273",
          "CHEMBL274274",
          "CHEMBL274594",
          "CHEMBL274778",
          "CHEMBL275084",
          "CHEMBL275262",
          "CHEMBL275263",
          "CHEMBL275329",
          "CHEMBL275421",
          "CHEMBL275635",
          "CHEMBL275793",
          "CHEMBL276138",
          "CHEMBL276201",
          "CHEMBL276227",
          "CHEMBL276321",
          "CHEMBL276401",
          "CHEMBL276528",
          "CHEMBL276603",
          "CHEMBL276830",
          "CHEMBL277357",
          "CHEMBL278197",
          "CHEMBL279410",
          "CHEMBL279870",
          "CHEMBL280080",
          "CHEMBL280278",
          "CHEMBL280300",
          "CHEMBL284578",
          "CHEMBL284969",
          "CHEMBL285819",
          "CHEMBL292917",
          "CHEMBL301814",
          "CHEMBL307199",
          "CHEMBL310557",
          "CHEMBL312811",
          "CHEMBL312859",
          "CHEMBL313864",
          "CHEMBL314765",
          "CHEMBL316630",
          "CHEMBL316687",
          "CHEMBL316824",
          "CHEMBL317270",
          "CHEMBL317411",
          "CHEMBL318323",
          "CHEMBL319534",
          "CHEMBL319555",
          "CHEMBL319580",
          "CHEMBL320093",
          "CHEMBL320283",
          "CHEMBL320741",
          "CHEMBL320805",
          "CHEMBL321330",
          "CHEMBL321441",
          "CHEMBL321769",
          "CHEMBL322228",
          "CHEMBL322263",
          "CHEMBL323074",
          "CHEMBL323288",
          "CHEMBL323303",
          "CHEMBL324100",
          "CHEMBL324419",
          "CHEMBL325715",
          "CHEMBL326752",
          "CHEMBL327853",
          "CHEMBL328214",
          "CHEMBL328334",
          "CHEMBL328437",
          "CHEMBL328812",
          "CHEMBL329293",
          "CHEMBL329294",
          "CHEMBL330399",
          "CHEMBL331540",
          "CHEMBL331946",
          "CHEMBL332969",
          "CHEMBL333872",
          "CHEMBL333943",
          "CHEMBL334224",
          "CHEMBL334286",
          "CHEMBL337517",
          "CHEMBL34004",
          "CHEMBL343256",
          "CHEMBL345839",
          "CHEMBL346676",
          "CHEMBL347250",
          "CHEMBL347834",
          "CHEMBL349026",
          "CHEMBL349519",
          "CHEMBL349650",
          "CHEMBL350078",
          "CHEMBL351481",
          "CHEMBL351691",
          "CHEMBL352089",
          "CHEMBL353115",
          "CHEMBL355370",
          "CHEMBL355898",
          "CHEMBL356239",
          "CHEMBL356507",
          "CHEMBL357024",
          "CHEMBL357346",
          "CHEMBL358076",
          "CHEMBL358341",
          "CHEMBL370883",
          "CHEMBL371131",
          "CHEMBL371697",
          "CHEMBL372045",
          "CHEMBL372420",
          "CHEMBL373317",
          "CHEMBL373950",
          "CHEMBL374620",
          "CHEMBL375066",
          "CHEMBL375154",
          "CHEMBL375558",
          "CHEMBL375677",
          "CHEMBL375690",
          "CHEMBL375885",
          "CHEMBL376193",
          "CHEMBL376366",
          "CHEMBL376588",
          "CHEMBL376747",
          "CHEMBL377523",
          "CHEMBL378514",
          "CHEMBL379791",
          "CHEMBL380031",
          "CHEMBL380162",
          "CHEMBL380586",
          "CHEMBL382107",
          "CHEMBL383134",
          "CHEMBL387592",
          "CHEMBL388344",
          "CHEMBL388388",
          "CHEMBL388520",
          "CHEMBL388818",
          "CHEMBL389060",
          "CHEMBL389222",
          "CHEMBL389388",
          "CHEMBL389405",
          "CHEMBL389644",
          "CHEMBL389696",
          "CHEMBL389856",
          "CHEMBL390096",
          "CHEMBL390359",
          "CHEMBL390530",
          "CHEMBL390777",
          "CHEMBL390968",
          "CHEMBL391004",
          "CHEMBL392149",
          "CHEMBL398543",
          "CHEMBL398544",
          "CHEMBL399306",
          "CHEMBL399514",
          "CHEMBL400189",
          "CHEMBL400190",
          "CHEMBL400330",
          "CHEMBL400331",
          "CHEMBL400782",
          "CHEMBL406993",
          "CHEMBL415248",
          "CHEMBL415697",
          "CHEMBL415971",
          "CHEMBL416354",
          "CHEMBL416537",
          "CHEMBL416884",
          "CHEMBL418333",
          "CHEMBL418797",
          "CHEMBL419002",
          "CHEMBL420705",
          "CHEMBL421420",
          "CHEMBL421782",
          "CHEMBL42639",
          "CHEMBL427178",
          "CHEMBL427255",
          "CHEMBL427437",
          "CHEMBL427718",
          "CHEMBL429032",
          "CHEMBL429667",
          "CHEMBL431733",
          "CHEMBL432950",
          "CHEMBL441815",
          "CHEMBL441954",
          "CHEMBL442005",
          "CHEMBL442333",
          "CHEMBL444550",
          "CHEMBL445067",
          "CHEMBL45891",
          "CHEMBL464859",
          "CHEMBL473634",
          "CHEMBL473648",
          "CHEMBL473649",
          "CHEMBL473650",
          "CHEMBL473839",
          "CHEMBL474016",
          "CHEMBL474636",
          "CHEMBL474977",
          "CHEMBL475792",
          "CHEMBL480143",
          "CHEMBL481858",
          "CHEMBL482504",
          "CHEMBL482701",
          "CHEMBL483116",
          "CHEMBL483309",
          "CHEMBL483310",
          "CHEMBL484112",
          "CHEMBL484313",
          "CHEMBL484314",
          "CHEMBL484497",
          "CHEMBL484520",
          "CHEMBL484720",
          "CHEMBL502005",
          "CHEMBL508203",
          "CHEMBL514155",
          "CHEMBL514156",
          "CHEMBL514196",
          "CHEMBL515433",
          "CHEMBL516372",
          "CHEMBL519319",
          "CHEMBL521299",
          "CHEMBL52333",
          "CHEMBL526134",
          "CHEMBL540094",
          "CHEMBL542748",
          "CHEMBL544856",
          "CHEMBL545362",
          "CHEMBL555624",
          "CHEMBL603400",
          "CHEMBL603977",
          "CHEMBL605034",
          "CHEMBL606495",
          "CHEMBL611115",
          "CHEMBL62350",
          "CHEMBL66393",
          "CHEMBL68738",
          "CHEMBL7098",
          "CHEMBL7113",
          "CHEMBL7142",
          "CHEMBL7269",
          "CHEMBL7327",
          "CHEMBL7334",
          "CHEMBL73809",
          "CHEMBL7493",
          "CHEMBL7608",
          "CHEMBL7909",
          "CHEMBL79415",
          "CHEMBL7953",
          "CHEMBL81885",
          "CHEMBL82222",
          "CHEMBL82389",
          "CHEMBL82616",
          "CHEMBL84545",
          "CHEMBL8488",
          "CHEMBL85195",
          "CHEMBL86274",
          "CHEMBL86275",
          "CHEMBL8907",
          "CHEMBL8966",
          "CHEMBL8969",
          "CHEMBL9069",
          "CHEMBL9335",
          "CHEMBL94538",
          "CHEMBL95384",
          "CHEMBL96576",
          "CHEMBL96617",
          "CHEMBL97037",
          "CHEMBL9725",
          "CHEMBL97286",
          "CHEMBL97337",
          "CHEMBL97344",
          "CHEMBL97549",
          "CHEMBL97624",
          "CHEMBL97663",
          "CHEMBL97665",
          "CHEMBL97687",
          "CHEMBL97757",
          "CHEMBL97760",
          "CHEMBL97778",
          "CHEMBL97895",
          "CHEMBL97896",
          "CHEMBL97904",
          "CHEMBL98227",
          "CHEMBL98678"
        ],
        "number_of_missing_values": "0"
      },
      {
        "data_type": "numeric",
        "index": "1",
        "is_ignore": "false",
        "is_row_identifier": "false",
        "is_target": "false",
        "name": "AMW",
        "number_of_missing_values": "0"
      },
      {
        "data_type": "numeric",
        "index": "2",
        "is_ignore": "false",
        "is_row_identifier": "false",
        "is_target": "false",
        "name": "C.",
        "number_of_missing_values": "0"
      },
      {
        "data_type": "numeric",
        "index": "3",
        "is_ignore": "false",
        "is_row_identifier": "false",
        "is_target": "false",
        "name": "H.",
        "number_of_missing_values": "0"
      },
      {
        "data_type": "numeric",
        "index": "4",
        "is_ignore": "false",
        "is_row_identifier": "false",
        "is_target": "false",
        "name": "Me",
        "number_of_missing_values": "0"
      },
      {
        "data_type": "numeric",
        "index": "5",
        "is_ignore": "false",
        "is_row_identifier": "false",
        "is_target": "false",
        "name": "Mi",
        "number_of_missing_values": "0"
      },
      {
        "data_type": "numeric",
        "index": "6",
        "is_ignore": "false",
        "is_row_identifier": "false",
        "is_target": "false",
        "name": "Mp",
        "number_of_missing_values": "0"
      },
      {
        "data_type": "numeric",
        "index": "7",
        "is_ignore": "false",
        "is_row_identifier": "false",
        "is_target": "false",
        "name": "Mv",
        "number_of_missing_values": "0"
      },
      {
        "data_type": "numeric",
        "index": "8",
        "is_ignore": "false",
        "is_row_identifier": "false",
        "is_target": "false",
        "name": "MW",
        "number_of_missing_values": "0"
      },
      {
        "data_type": "numeric",
        "index": "9",
        "is_ignore": "false",
        "is_row_identifier": "false",
        "is_target": "false",
        "name": "N.",
        "number_of_missing_values": "0"
      },
      {
        "data_type": "numeric",
        "index": "10",
        "is_ignore": "false",
        "is_row_identifier": "false",
        "is_target": "false",
        "name": "nAB",
        "number_of_missing_values": "0"
      },
      {
        "data_type": "numeric",
        "index": "11",
        "is_ignore": "false",
        "is_row_identifier": "false",
        "is_target": "false",
        "name": "nAT",
        "number_of_missing_values": "0"
      },
      {
        "data_type": "numeric",
        "index": "12",
        "is_ignore": "false",
        "is_row_identifier": "false",
        "is_target": "false",
        "name": "nB",
        "number_of_missing_values": "0"
      },
      {
        "data_type": "numeric",
        "index": "13",
        "is_ignore": "false",
        "is_row_identifier": "false",
        "is_target": "false",
        "name": "nBM",
        "number_of_missing_values": "0"
      },
      {
        "data_type": "numeric",
        "index": "14",
        "is_ignore": "false",
        "is_row_identifier": "false",
        "is_target": "false",
        "name": "nBO",
        "number_of_missing_values": "0"
      },
      {
        "data_type": "numeric",
        "index": "15",
        "is_ignore": "false",
        "is_row_identifier": "false",
        "is_target": "false",
        "name": "nBR",
        "number_of_missing_values": "0"
      },
      {
        "data_type": "numeric",
        "index": "16",
        "is_ignore": "false",
        "is_row_identifier": "false",
        "is_target": "false",
        "name": "nBT",
        "number_of_missing_values": "0"
      },
      {
        "data_type": "numeric",
        "index": "17",
        "is_ignore": "false",
        "is_row_identifier": "false",
        "is_target": "false",
        "name": "nC",
        "number_of_missing_values": "0"
      },
      {
        "data_type": "numeric",
        "index": "18",
        "is_ignore": "false",
        "is_row_identifier": "false",
        "is_target": "false",
        "name": "nCL",
        "number_of_missing_values": "0"
      },
      {
        "data_type": "numeric",
        "index": "19",
        "is_ignore": "false",
        "is_row_identifier": "false",
        "is_target": "false",
        "name": "nCsp",
        "number_of_missing_values": "0"
      },
      {
        "data_type": "numeric",
        "index": "20",
        "is_ignore": "false",
        "is_row_identifier": "false",
        "is_target": "false",
        "name": "nCsp2",
        "number_of_missing_values": "0"
      },
      {
        "data_type": "numeric",
        "index": "21",
        "is_ignore": "false",
        "is_row_identifier": "false",
        "is_target": "false",
        "name": "nCsp3",
        "number_of_missing_values": "0"
      },
      {
        "data_type": "numeric",
        "index": "22",
        "is_ignore": "false",
        "is_row_identifier": "false",
        "is_target": "false",
        "name": "nDB",
        "number_of_missing_values": "0"
      },
      {
        "data_type": "numeric",
        "index": "23",
        "is_ignore": "false",
        "is_row_identifier": "false",
        "is_target": "false",
        "name": "nF",
        "number_of_missing_values": "0"
      },
      {
        "data_type": "numeric",
        "index": "24",
        "is_ignore": "false",
        "is_row_identifier": "false",
        "is_target": "false",
        "name": "nH",
        "number_of_missing_values": "0"
      },
      {
        "data_type": "numeric",
        "index": "25",
        "is_ignore": "false",
        "is_row_identifier": "false",
        "is_target": "false",
        "name": "nHet",
        "number_of_missing_values": "0"
      },
      {
        "data_type": "numeric",
        "index": "26",
        "is_ignore": "false",
        "is_row_identifier": "false",
        "is_target": "false",
        "name": "nHM",
        "number_of_missing_values": "0"
      },
      {
        "data_type": "numeric",
        "index": "27",
        "is_ignore": "false",
        "is_row_identifier": "false",
        "is_target": "false",
        "name": "nI",
        "number_of_missing_values": "0"
      },
      {
        "data_type": "numeric",
        "index": "28",
        "is_ignore": "false",
        "is_row_identifier": "false",
        "is_target": "false",
        "name": "nN",
        "number_of_missing_values": "0"
      },
      {
        "data_type": "numeric",
        "index": "29",
        "is_ignore": "false",
        "is_row_identifier": "false",
        "is_target": "false",
        "name": "nO",
        "number_of_missing_values": "0"
      },
      {
        "data_type": "numeric",
        "index": "30",
        "is_ignore": "false",
        "is_row_identifier": "false",
        "is_target": "false",
        "name": "nP",
        "number_of_missing_values": "0"
      },
      {
        "data_type": "numeric",
        "index": "31",
        "is_ignore": "false",
        "is_row_identifier": "false",
        "is_target": "false",
        "name": "nS",
        "number_of_missing_values": "0"
      },
      {
        "data_type": "numeric",
        "index": "32",
        "is_ignore": "false",
        "is_row_identifier": "false",
        "is_target": "false",
        "name": "nSK",
        "number_of_missing_values": "0"
      },
      {
        "data_type": "numeric",
        "index": "33",
        "is_ignore": "false",
        "is_row_identifier": "false",
        "is_target": "false",
        "name": "nTB",
        "number_of_missing_values": "0"
      },
      {
        "data_type": "numeric",
        "index": "34",
        "is_ignore": "false",
        "is_row_identifier": "false",
        "is_target": "false",
        "name": "nX",
        "number_of_missing_values": "0"
      },
      {
        "data_type": "numeric",
        "index": "35",
        "is_ignore": "false",
        "is_row_identifier": "false",
        "is_target": "false",
        "name": "O.",
        "number_of_missing_values": "0"
      },
      {
        "data_type": "numeric",
        "index": "36",
        "is_ignore": "false",
        "is_row_identifier": "false",
        "is_target": "false",
        "name": "RBF",
        "number_of_missing_values": "0"
      },
      {
        "data_type": "numeric",
        "index": "37",
        "is_ignore": "false",
        "is_row_identifier": "false",
        "is_target": "false",
        "name": "RBN",
        "number_of_missing_values": "0"
      },
      {
        "data_type": "numeric",
        "index": "38",
        "is_ignore": "false",
        "is_row_identifier": "false",
        "is_target": "false",
        "name": "SCBO",
        "number_of_missing_values": "0"
      },
      {
        "data_type": "numeric",
        "index": "39",
        "is_ignore": "false",
        "is_row_identifier": "false",
        "is_target": "false",
        "name": "Se",
        "number_of_missing_values": "0"
      },
      {
        "data_type": "numeric",
        "index": "40",
        "is_ignore": "false",
        "is_row_identifier": "false",
        "is_target": "false",
        "name": "Si",
        "number_of_missing_values": "0"
      },
      {
        "data_type": "numeric",
        "index": "41",
        "is_ignore": "false",
        "is_row_identifier": "false",
        "is_target": "false",
        "name": "Sp",
        "number_of_missing_values": "0"
      },
      {
        "data_type": "numeric",
        "index": "42",
        "is_ignore": "false",
        "is_row_identifier": "false",
        "is_target": "false",
        "name": "Sv",
        "number_of_missing_values": "0"
      },
      {
        "data_type": "numeric",
        "index": "43",
        "is_ignore": "false",
        "is_row_identifier": "false",
        "is_target": "false",
        "name": "X.",
        "number_of_missing_values": "0"
      },
      {
        "data_type": "numeric",
        "index": "44",
        "is_ignore": "false",
        "is_row_identifier": "false",
        "is_target": "true",
        "name": "pXC50",
        "number_of_missing_values": "0"
      }
    ]
  }
}