"molecule_id","AMW","C.","H.","Me","Mi","Mp","Mv","MW","N.","pXC50"
{1 8.463,2 40.5,3 40.5,4 1.013,5 1.127,6 0.694,7 0.664,8 355.46,9 11.9,10 5.824}
{0 CHEMBL190438,1 8.28,2 41.5,3 41.5,4 1.005,5 1.125,6 0.7,7 0.663,8 339.46,9 12.2,10 4.07}
{0 CHEMBL190439,1 9.294,2 43.2,3 37.8,4 1.009,5 1.12,6 0.739,7 0.696,8 343.87,9 13.5,10 4.375}
{0 CHEMBL190518,1 8.153,2 38.8,3 42.9,4 1.013,5 1.13,6 0.676,7 0.646,8 399.52,9 10.2,10 5.824}
{0 CHEMBL190654,1 8.106,2 34.6,3 44.2,4 1.023,5 1.138,6 0.65,7 0.627,8 421.53,9 9.6,10 4.301}
{0 CHEMBL191241,1 8.28,2 41.5,3 41.5,4 1.005,5 1.125,6 0.7,7 0.663,8 339.46,9 12.2,10 6.013}
{0 CHEMBL191268,1 8.479,2 36,3 44,4 1.017,5 1.134,6 0.675,7 0.64,8 423.97,9 10,10 6.071}
{0 CHEMBL191601,1 7.815,2 37,3 45.7,4 1.007,5 1.134,6 0.667,7 0.629,8 359.5,9 10.9,10 5.553}
{0 CHEMBL191635,1 11.35,2 41.5,3 39,4 1.007,5 1.118,6 0.765,7 0.695,8 465.35,9 12.2,10 7.301}
{0 CHEMBL191641,1 7.791,2 36,3 46,4 1.01,5 1.136,6 0.658,7 0.624,8 389.53,9 10,10 5.509}
{0 CHEMBL191668,1 7.77,2 35.2,3 46.3,4 1.014,5 1.137,6 0.65,7 0.619,8 419.56,9 9.3,10 5.469}
{0 CHEMBL191786,1 8.741,2 35.2,3 42.6,4 1.029,5 1.142,6 0.665,7 0.641,8 471.99,9 9.3,10 6.796}
{0 CHEMBL191835,1 8.128,2 37.3,3 43.1,4 1.014,5 1.135,6 0.669,7 0.641,8 414.54,9 11.8,10 4}
{0 CHEMBL191920,1 8.839,2 36,3 42,4 1.027,5 1.141,6 0.674,7 0.648,8 441.96,9 10,10 5.62}
{0 CHEMBL192013,1 10.225,2 43.2,3 35.1,4 1.018,5 1.118,6 0.762,7 0.718,8 378.31,9 13.5,10 4.517}
{0 CHEMBL192062,1 9.12,2 41.5,3 39,4 1.013,5 1.123,6 0.721,7 0.683,8 373.9,9 12.2,10 6.699}
{0 CHEMBL192145,1 10.204,2 41.5,3 39,4 1.011,5 1.121,6 0.733,7 0.688,8 418.35,9 12.2,10 7.155}
{0 CHEMBL192480,1 11.155,2 43.2,3 32.4,4 1.026,5 1.117,6 0.785,7 0.741,8 412.75,9 13.5,10 5.071}
{0 CHEMBL192647,1 8.856,2 38.8,3 40.8,4 1.02,5 1.129,6 0.694,7 0.663,8 433.96,9 10.2,10 6.745}
{0 CHEMBL192649,1 8.034,2 37.2,3 44.2,4 1.01,5 1.133,6 0.672,7 0.637,8 345.47,9 11.6,10 5.328}
{0 CHEMBL192761,1 7.952,2 35.3,3 45.1,4 1.017,5 1.137,6 0.654,7 0.625,8 405.53,9 9.8,10 4.116}
{0 CHEMBL192937,1 8.769,2 34.6,3 42.3,4 1.029,5 1.137,6 0.667,7 0.643,8 455.97,9 9.6,10 5.319}
{0 CHEMBL193056,1 10.723,2 38.8,3 40.8,4 1.014,5 1.124,6 0.73,7 0.673,8 525.41,9 10.2,10 5.509}
{0 CHEMBL193259,1 8.521,2 38.8,3 40.8,4 1.023,5 1.137,6 0.675,7 0.654,8 417.51,9 10.2,10 5.824}
{0 CHEMBL193282,1 9.223,2 38.8,3 38.8,4 1.03,5 1.136,6 0.692,7 0.671,8 451.95,9 10.2,10 6.921}
{0 CHEMBL193310,1 8.461,2 37.3,3 41.2,4 1.025,5 1.133,6 0.667,7 0.649,8 431.52,9 9.8,10 4.301}
{0 CHEMBL193313,1 8.064,2 33.9,3 44.6,4 1.025,5 1.14,6 0.643,7 0.622,8 451.56,9 8.9,10 4.301}
{0 CHEMBL193672,1 7.989,2 36.2,3 44.7,4 1.014,5 1.135,6 0.662,7 0.631,8 375.5,9 10.6,10 5.456}
{0 CHEMBL193892,1 8.28,2 41.5,3 41.5,4 1.005,5 1.125,6 0.7,7 0.663,8 339.46,9 12.2,10 4.457}
{0 CHEMBL194716,1 13.332,2 42.3,3 23.1,4 1.051,5 1.118,6 0.837,7 0.801,8 346.64,9 19.2,10 4.812}
{0 CHEMBL195096,1 7.849,2 41.9,3 44.2,4 0.995,5 1.124,6 0.698,7 0.651,8 337.49,9 11.6,10 4.975}
{0 CHEMBL195869,1 7.845,2 38.1,3 45.2,4 1.002,5 1.132,6 0.678,7 0.636,8 329.47,9 11.9,10 5.337}
{0 CHEMBL273986,1 8.211,2 40,3 42.2,4 1.009,5 1.127,6 0.687,7 0.654,8 369.49,9 11.1,10 6.721}
{0 CHEMBL362972,1 8.156,2 35.4,3 43.8,4 1.02,5 1.137,6 0.658,7 0.633,8 391.5,9 10.4,10 4.301}
{0 CHEMBL363196,1 9.313,2 37,3 41.3,4 1.021,5 1.131,6 0.704,7 0.665,8 428.38,9 10.9,10 5.301}
{0 CHEMBL363860,1 8.368,2 42.9,3 40.5,4 1.005,5 1.122,6 0.707,7 0.671,8 351.47,9 11.9,10 5.569}
{0 CHEMBL364239,1 7.849,2 41.9,3 44.2,4 0.995,5 1.124,6 0.698,7 0.651,8 337.49,9 11.6,10 4.873}
{0 CHEMBL364272,1 12.008,2 42.3,3 26.9,4 1.038,5 1.12,6 0.804,7 0.769,8 312.2,9 19.2,10 4.07}
{0 CHEMBL364450,1 10.225,2 43.2,3 35.1,4 1.018,5 1.118,6 0.762,7 0.718,8 378.31,9 13.5,10 5.678}
{0 CHEMBL364456,1 10.297,2 42.5,3 32.5,4 1.044,5 1.147,6 0.723,7 0.711,8 411.87,9 12.5,10 5.432}
{0 CHEMBL364730,1 8.322,2 44.4,3 40,4 1,5 1.12,6 0.717,7 0.677,8 374.51,9 13.3,10 4}
{0 CHEMBL365118,1 10.225,2 43.2,3 35.1,4 1.018,5 1.118,6 0.762,7 0.718,8 378.31,9 13.5,10 4.426}
{0 CHEMBL365159,1 10.808,2 42.5,3 35,4 1.022,5 1.119,6 0.744,7 0.71,8 432.33,9 12.5,10 7.523}
{0 CHEMBL370092,1 7.919,2 34.5,3 45.5,4 1.019,5 1.138,6 0.647,7 0.621,8 435.56,9 9.1,10 5.638}
{0 CHEMBL370247,1 9.045,2 35.2,3 42.6,4 1.026,5 1.135,6 0.682,7 0.65,8 488.44,9 9.3,10 5.678}
{0 CHEMBL370286,1 8.28,2 41.5,3 41.5,4 1.005,5 1.125,6 0.7,7 0.663,8 339.46,9 12.2,10 4.719}
{0 CHEMBL371372,1 9.596,2 41.5,3 34.1,4 1.043,5 1.15,6 0.695,7 0.691,8 393.43,9 12.2,10 5.252}
{0 CHEMBL371570,1 8.211,2 40,3 42.2,4 1.009,5 1.127,6 0.687,7 0.654,8 369.49,9 11.1,10 5.699}
{0 CHEMBL372013,1 8.215,2 36.4,3 43.2,4 1.017,5 1.135,6 0.667,7 0.639,8 361.47,9 11.4,10 4.301}
{0 CHEMBL415775,1 11.923,2 41.4,3 24.1,4 1.072,5 1.159,6 0.746,7 0.754,8 345.76,9 17.2,10 4.042}
{0 CHEMBL424824,1 7.849,2 41.9,3 44.2,4 0.995,5 1.124,6 0.698,7 0.651,8 337.49,9 11.6,10 5.066}
{0 CHEMBL426086,1 9.294,2 43.2,3 37.8,4 1.009,5 1.12,6 0.739,7 0.696,8 343.87,9 13.5,10 5.469}
{0 CHEMBL427169,1 8.639,2 39.5,3 39.5,4 1.02,5 1.129,6 0.689,7 0.665,8 371.46,9 11.6,10 4.301}
{0 CHEMBL439852,1 8.103,2 35.2,3 44.4,4 1.023,5 1.143,6 0.649,7 0.626,8 437.55,9 9.3,10 5.602}
