"molecule_id","MW","nSK","pXC50"
{1 414.61,2 27,3 6.535}
{0 CHEMBL129887,1 434.59,2 30,3 5.584}
{0 CHEMBL129976,1 452.66,2 33,3 5}
{0 CHEMBL130577,1 447.54,2 32,3 5}
{0 CHEMBL131561,1 430.63,2 30,3 5.502}
{0 CHEMBL132488,1 452.58,2 31,3 5}
{0 CHEMBL133176,1 396.62,2 29,3 5.492}
{0 CHEMBL1934476,1 456,2 31,3 4.886}
{0 CHEMBL288436,1 363.54,2 27,3 6}
{0 CHEMBL335751,1 414.56,2 30,3 5.368}
{0 CHEMBL335762,1 476.68,2 33,3 5.182}
{0 CHEMBL336086,1 414.61,2 30,3 5.327}
{0 CHEMBL337719,1 436.56,2 31,3 5.182}
{0 CHEMBL339298,1 430.63,2 30,3 5.757}
{0 CHEMBL340074,1 418.57,2 30,3 5.327}
{0 CHEMBL340555,1 434.59,2 30,3 5.502}
{0 CHEMBL42314,1 420.59,2 30,3 5.253}
{0 CHEMBL445634,1 424.6,2 31,3 5}
{0 CHEMBL482524,1 370.42,2 28,3 5.444}
{0 CHEMBL482525,1 388.41,2 29,3 6.699}
{0 CHEMBL482531,1 430.48,2 32,3 4.25}
{0 CHEMBL519968,1 425.46,2 32,3 5.721}
{0 CHEMBL595,1 356.48,2 25,3 6.155}
