{
  "data_features": {
    "feature": [
      {
        "data_type": "nominal",
        "index": "0",
        "is_ignore": "false",
        "is_row_identifier": "true",
        "is_target": "false",
        "name": "molecule_id",
        "nominal_value": [
          "CHEMBL1258223",
          "CHEMBL1258452",
          "CHEMBL1258671",
          "CHEMBL126347",
          "CHEMBL129190",
          "CHEMBL13560",
          "CHEMBL14059",
          "CHEMBL1437",
          "CHEMBL143865",
          "CHEMBL1800936",
          "CHEMBL1800961",
          "CHEMBL1800963",
          "CHEMBL206100",
          "CHEMBL2079543",
          "CHEMBL2079599",
          "CHEMBL228992",
          "CHEMBL228996",
          "CHEMBL229401",
          "CHEMBL229476",
          "CHEMBL229614",
          "CHEMBL243266",
          "CHEMBL244687",
          "CHEMBL281232",
          "CHEMBL284520",
          "CHEMBL284782",
          "CHEMBL285888",
          "CHEMBL287587",
          "CHEMBL289670",
          "CHEMBL32115",
          "CHEMBL32391",
          "CHEMBL32470",
          "CHEMBL32532",
          "CHEMBL32586",
          "CHEMBL32590",
          "CHEMBL32670",
          "CHEMBL32933",
          "CHEMBL32939",
          "CHEMBL33360",
          "CHEMBL33399",
          "CHEMBL35459",
          "CHEMBL35738",
          "CHEMBL363325",
          "CHEMBL38486",
          "CHEMBL388570",
          "CHEMBL395082",
          "CHEMBL417137",
          "CHEMBL42",
          "CHEMBL42084",
          "CHEMBL434",
          "CHEMBL45063",
          "CHEMBL479",
          "CHEMBL54",
          "CHEMBL544427",
          "CHEMBL679",
          "CHEMBL785"
        ],
        "number_of_missing_values": "0"
      },
      {
        "data_type": "numeric",
        "index": "1",
        "is_ignore": "false",
        "is_row_identifier": "false",
        "is_target": "false",
        "name": "O.",
        "number_of_missing_values": "0"
      },
      {
        "data_type": "numeric",
        "index": "2",
        "is_ignore": "false",
        "is_row_identifier": "false",
        "is_target": "false",
        "name": "nO",
        "number_of_missing_values": "0"
      },
      {
        "data_type": "numeric",
        "index": "3",
        "is_ignore": "false",
        "is_row_identifier": "false",
        "is_target": "false",
        "name": "AMW",
        "number_of_missing_values": "0"
      },
      {
        "data_type": "numeric",
        "index": "4",
        "is_ignore": "false",
        "is_row_identifier": "false",
        "is_target": "false",
        "name": "C.",
        "number_of_missing_values": "0"
      },
      {
        "data_type": "numeric",
        "index": "5",
        "is_ignore": "false",
        "is_row_identifier": "false",
        "is_target": "false",
        "name": "H.",
        "number_of_missing_values": "0"
      },
      {
        "data_type": "numeric",
        "index": "6",
        "is_ignore": "false",
        "is_row_identifier": "false",
        "is_target": "false",
        "name": "Me",
        "number_of_missing_values": "0"
      },
      {
        "data_type": "numeric",
        "index": "7",
        "is_ignore": "false",
        "is_row_identifier": "false",
        "is_target": "true",
        "name": "pXC50",
        "number_of_missing_values": "0"
      }
    ]
  }
}