{
  "data_set_description": {
    "collection_date": "November 2013",
    "creator": "Dr Jeremy Besnard, Dr Ivan Olier, Dr Noureddin Sadawi, Dr Larisa Soldatova, Dr Crina Grosan, Prof Ross King, Dr Richard Bickerton, Prof Andrew Hopkins and Dr Willem van Hoorn",
    "default_target_attribute": "pXC50",
    "description": "This dataset contains QSAR data (from ChEMBL version 17) showing activity values (unit is pseudo-pCI50) of several compounds on drug target ChEMBL_ID: CHEMBL6137 (TID: 102440), and it has 227 rows and 43 features (not including molecule IDs and class feature: molecule_id and pXC50). The features represent Basic Molecular Descriptors which were generated from SMILES strings.  Missing value imputation was applied to this dataset (By choosing the Median).",
    "description_version": "1",
    "file_id": "3604656",
    "format": "ARFF",
    "id": "37097",
    "licence": "Public",
    "md5_checksum": "980c6d42e680092c5e94898417dffdc7",
    "minio_url": "https://data.openml.org/datasets/0003/37097/dataset_37097.pq",
    "name": "QSAR-DATASET-FOR-DRUG-TARGET-CHEMBL6137",
    "original_data_url": "https://www.ebi.ac.uk/chembl/target/inspect/CHEMBL6137",
    "parquet_url": "https://data.openml.org/datasets/0003/37097/dataset_37097.pq",
    "processing_date": "2018-10-04 05:09:12",
    "row_id_attribute": "molecule_id",
    "status": "deactivated",
    "tag": [
      "MetaQSAR",
      "study_13"
    ],
    "upload_date": "2016-07-15T23:28:20",
    "url": "https://api.openml.org/data/v1/download/3604656/QSAR-DATASET-FOR-DRUG-TARGET-CHEMBL6137.arff",
    "version": "11",
    "visibility": "public"
  }
}