{
  "data_features": {
    "feature": [
      {
        "data_type": "nominal",
        "index": "0",
        "is_ignore": "false",
        "is_row_identifier": "true",
        "is_target": "false",
        "name": "molecule_id",
        "nominal_value": [
          "CHEMBL1256753",
          "CHEMBL1301329",
          "CHEMBL1304621",
          "CHEMBL1306270",
          "CHEMBL1306290",
          "CHEMBL1306390",
          "CHEMBL1306438",
          "CHEMBL1306608",
          "CHEMBL1307103",
          "CHEMBL1307173",
          "CHEMBL1307636",
          "CHEMBL1308686",
          "CHEMBL1309129",
          "CHEMBL1309598",
          "CHEMBL1309849",
          "CHEMBL1310077",
          "CHEMBL1310567",
          "CHEMBL1310638",
          "CHEMBL1312991",
          "CHEMBL1313434",
          "CHEMBL1313527",
          "CHEMBL1319502",
          "CHEMBL1319618",
          "CHEMBL1321070",
          "CHEMBL1322827",
          "CHEMBL1324170",
          "CHEMBL1324698",
          "CHEMBL1324866",
          "CHEMBL1328334",
          "CHEMBL1329490",
          "CHEMBL1329772",
          "CHEMBL1329925",
          "CHEMBL1330018",
          "CHEMBL1331089",
          "CHEMBL1333562",
          "CHEMBL1333679",
          "CHEMBL1335117",
          "CHEMBL1336077",
          "CHEMBL1336358",
          "CHEMBL1336532",
          "CHEMBL1336678",
          "CHEMBL1339229",
          "CHEMBL1339961",
          "CHEMBL1340780",
          "CHEMBL1341110",
          "CHEMBL1342776",
          "CHEMBL1345166",
          "CHEMBL1346377",
          "CHEMBL1347779",
          "CHEMBL1348043",
          "CHEMBL1348839",
          "CHEMBL1349839",
          "CHEMBL1351173",
          "CHEMBL1351659",
          "CHEMBL1352208",
          "CHEMBL1352344",
          "CHEMBL1353791",
          "CHEMBL1353986",
          "CHEMBL1359145",
          "CHEMBL1359986",
          "CHEMBL1360021",
          "CHEMBL1361947",
          "CHEMBL1365061",
          "CHEMBL1368140",
          "CHEMBL1369781",
          "CHEMBL1370397",
          "CHEMBL1370522",
          "CHEMBL1373476",
          "CHEMBL1375102",
          "CHEMBL1375987",
          "CHEMBL1377193",
          "CHEMBL1377321",
          "CHEMBL1377681",
          "CHEMBL1378564",
          "CHEMBL1380043",
          "CHEMBL1382128",
          "CHEMBL1382411",
          "CHEMBL1383045",
          "CHEMBL1383916",
          "CHEMBL1385150",
          "CHEMBL1388571",
          "CHEMBL1389483",
          "CHEMBL1389846",
          "CHEMBL1391480",
          "CHEMBL1393535",
          "CHEMBL1400385",
          "CHEMBL1401790",
          "CHEMBL1402083",
          "CHEMBL1404881",
          "CHEMBL1405843",
          "CHEMBL1406072",
          "CHEMBL1408062",
          "CHEMBL1408066",
          "CHEMBL1409796",
          "CHEMBL1411259",
          "CHEMBL1412812",
          "CHEMBL1414923",
          "CHEMBL1419072",
          "CHEMBL1421574",
          "CHEMBL1421892",
          "CHEMBL1422566",
          "CHEMBL1422729",
          "CHEMBL1428566",
          "CHEMBL1428855",
          "CHEMBL1429643",
          "CHEMBL1429822",
          "CHEMBL1430184",
          "CHEMBL1430530",
          "CHEMBL1433195",
          "CHEMBL1437613",
          "CHEMBL1439831",
          "CHEMBL1442405",
          "CHEMBL1443557",
          "CHEMBL1444583",
          "CHEMBL1446056",
          "CHEMBL1446118",
          "CHEMBL1446321",
          "CHEMBL1447560",
          "CHEMBL1448317",
          "CHEMBL1448575",
          "CHEMBL1448614",
          "CHEMBL1448963",
          "CHEMBL1448984",
          "CHEMBL1449689",
          "CHEMBL1450215",
          "CHEMBL1452750",
          "CHEMBL1453170",
          "CHEMBL1453955",
          "CHEMBL1458360",
          "CHEMBL1458844",
          "CHEMBL1458848",
          "CHEMBL1460619",
          "CHEMBL1460624",
          "CHEMBL1461019",
          "CHEMBL1461460",
          "CHEMBL1462178",
          "CHEMBL1462734",
          "CHEMBL1465176",
          "CHEMBL1465815",
          "CHEMBL1466293",
          "CHEMBL1468000",
          "CHEMBL1469400",
          "CHEMBL1469613",
          "CHEMBL1470369",
          "CHEMBL1470726",
          "CHEMBL1471422",
          "CHEMBL1472554",
          "CHEMBL1472570",
          "CHEMBL1478815",
          "CHEMBL1478945",
          "CHEMBL1479177",
          "CHEMBL1479781",
          "CHEMBL1484458",
          "CHEMBL1485942",
          "CHEMBL1489778",
          "CHEMBL1489784",
          "CHEMBL1490716",
          "CHEMBL1492498",
          "CHEMBL1494852",
          "CHEMBL1496679",
          "CHEMBL1497433",
          "CHEMBL1498988",
          "CHEMBL1502443",
          "CHEMBL1504000",
          "CHEMBL1504123",
          "CHEMBL1504286",
          "CHEMBL1504676",
          "CHEMBL1506427",
          "CHEMBL1507239",
          "CHEMBL1507439",
          "CHEMBL1508221",
          "CHEMBL1508357",
          "CHEMBL1509135",
          "CHEMBL1516758",
          "CHEMBL1517137",
          "CHEMBL1517376",
          "CHEMBL1521000",
          "CHEMBL1521361",
          "CHEMBL1522257",
          "CHEMBL1523363",
          "CHEMBL1523835",
          "CHEMBL1526936",
          "CHEMBL1527502",
          "CHEMBL1527508",
          "CHEMBL1527735",
          "CHEMBL1527978",
          "CHEMBL1528306",
          "CHEMBL1528702",
          "CHEMBL1529824",
          "CHEMBL1531705",
          "CHEMBL1532116",
          "CHEMBL1534146",
          "CHEMBL1534723",
          "CHEMBL1535190",
          "CHEMBL1535933",
          "CHEMBL1539092",
          "CHEMBL1539706",
          "CHEMBL1540007",
          "CHEMBL1540576",
          "CHEMBL1540621",
          "CHEMBL1541349",
          "CHEMBL1542307",
          "CHEMBL1542598",
          "CHEMBL1543131",
          "CHEMBL1543943",
          "CHEMBL1544658",
          "CHEMBL1544798",
          "CHEMBL1546739",
          "CHEMBL1548734",
          "CHEMBL1550026",
          "CHEMBL1550463",
          "CHEMBL1560584",
          "CHEMBL1560703",
          "CHEMBL1561400",
          "CHEMBL1563418",
          "CHEMBL1568833",
          "CHEMBL1569585",
          "CHEMBL1570114",
          "CHEMBL1570509",
          "CHEMBL1572983",
          "CHEMBL1573157",
          "CHEMBL1573517",
          "CHEMBL1574121",
          "CHEMBL1575416",
          "CHEMBL1576177",
          "CHEMBL1577540",
          "CHEMBL1578467",
          "CHEMBL1578505",
          "CHEMBL1579792",
          "CHEMBL1581124",
          "CHEMBL1585420",
          "CHEMBL1585618",
          "CHEMBL1586687",
          "CHEMBL1588763",
          "CHEMBL1595964",
          "CHEMBL1595978",
          "CHEMBL1596184",
          "CHEMBL1598968",
          "CHEMBL1599029",
          "CHEMBL1602153",
          "CHEMBL1602160",
          "CHEMBL1603040",
          "CHEMBL1603731",
          "CHEMBL1605435",
          "CHEMBL1606000",
          "CHEMBL1609569",
          "CHEMBL1609760",
          "CHEMBL1612488",
          "CHEMBL1612851",
          "CHEMBL1966192",
          "CHEMBL1968278",
          "CHEMBL1971695",
          "CHEMBL1976525",
          "CHEMBL1981797",
          "CHEMBL1985429",
          "CHEMBL1994036",
          "CHEMBL2004226",
          "CHEMBL449209",
          "CHEMBL455399",
          "CHEMBL494559",
          "CHEMBL548708",
          "CHEMBL581449",
          "CHEMBL584031",
          "CHEMBL601135",
          "CHEMBL7634"
        ],
        "number_of_missing_values": "0"
      },
      {
        "data_type": "numeric",
        "index": "1",
        "is_ignore": "false",
        "is_row_identifier": "false",
        "is_target": "false",
        "name": "ATSC4p",
        "number_of_missing_values": "0"
      },
      {
        "data_type": "numeric",
        "index": "2",
        "is_ignore": "false",
        "is_row_identifier": "false",
        "is_target": "false",
        "name": "SpMin1_Bh.v.",
        "number_of_missing_values": "0"
      },
      {
        "data_type": "numeric",
        "index": "3",
        "is_ignore": "false",
        "is_row_identifier": "false",
        "is_target": "false",
        "name": "SpMAD_EA.ed.",
        "number_of_missing_values": "0"
      },
      {
        "data_type": "numeric",
        "index": "4",
        "is_ignore": "false",
        "is_row_identifier": "false",
        "is_target": "false",
        "name": "Eig01_EA",
        "number_of_missing_values": "0"
      },
      {
        "data_type": "numeric",
        "index": "5",
        "is_ignore": "false",
        "is_row_identifier": "false",
        "is_target": "false",
        "name": "SM09_AEA.bo.",
        "number_of_missing_values": "0"
      },
      {
        "data_type": "numeric",
        "index": "6",
        "is_ignore": "false",
        "is_row_identifier": "false",
        "is_target": "false",
        "name": "SpDiam_EA",
        "number_of_missing_values": "0"
      },
      {
        "data_type": "numeric",
        "index": "7",
        "is_ignore": "false",
        "is_row_identifier": "false",
        "is_target": "false",
        "name": "SpMax_EA",
        "number_of_missing_values": "0"
      },
      {
        "data_type": "numeric",
        "index": "8",
        "is_ignore": "false",
        "is_row_identifier": "false",
        "is_target": "false",
        "name": "Eig01_AEA.ed.",
        "number_of_missing_values": "0"
      },
      {
        "data_type": "numeric",
        "index": "9",
        "is_ignore": "false",
        "is_row_identifier": "false",
        "is_target": "false",
        "name": "SpMax_AEA.ed.",
        "number_of_missing_values": "0"
      },
      {
        "data_type": "numeric",
        "index": "10",
        "is_ignore": "false",
        "is_row_identifier": "false",
        "is_target": "false",
        "name": "MATS2p",
        "number_of_missing_values": "0"
      },
      {
        "data_type": "numeric",
        "index": "11",
        "is_ignore": "false",
        "is_row_identifier": "false",
        "is_target": "false",
        "name": "ATSC5v",
        "number_of_missing_values": "0"
      },
      {
        "data_type": "numeric",
        "index": "12",
        "is_ignore": "false",
        "is_row_identifier": "false",
        "is_target": "false",
        "name": "SpDiam_EA.ed.",
        "number_of_missing_values": "0"
      },
      {
        "data_type": "numeric",
        "index": "13",
        "is_ignore": "false",
        "is_row_identifier": "false",
        "is_target": "false",
        "name": "P_VSA_s_5",
        "number_of_missing_values": "0"
      },
      {
        "data_type": "numeric",
        "index": "14",
        "is_ignore": "false",
        "is_row_identifier": "false",
        "is_target": "false",
        "name": "SAdon",
        "number_of_missing_values": "0"
      },
      {
        "data_type": "numeric",
        "index": "15",
        "is_ignore": "false",
        "is_row_identifier": "false",
        "is_target": "false",
        "name": "CATS2D_02_DL",
        "number_of_missing_values": "0"
      },
      {
        "data_type": "numeric",
        "index": "16",
        "is_ignore": "false",
        "is_row_identifier": "false",
        "is_target": "false",
        "name": "SpMin1_Bh.s.",
        "number_of_missing_values": "0"
      },
      {
        "data_type": "numeric",
        "index": "17",
        "is_ignore": "false",
        "is_row_identifier": "false",
        "is_target": "false",
        "name": "X3v",
        "number_of_missing_values": "0"
      },
      {
        "data_type": "numeric",
        "index": "18",
        "is_ignore": "false",
        "is_row_identifier": "false",
        "is_target": "false",
        "name": "X4v",
        "number_of_missing_values": "0"
      },
      {
        "data_type": "numeric",
        "index": "19",
        "is_ignore": "false",
        "is_row_identifier": "false",
        "is_target": "false",
        "name": "AAC",
        "number_of_missing_values": "0"
      },
      {
        "data_type": "numeric",
        "index": "20",
        "is_ignore": "false",
        "is_row_identifier": "false",
        "is_target": "false",
        "name": "AECC",
        "number_of_missing_values": "0"
      },
      {
        "data_type": "numeric",
        "index": "21",
        "is_ignore": "false",
        "is_row_identifier": "false",
        "is_target": "false",
        "name": "ALOGP",
        "number_of_missing_values": "0"
      },
      {
        "data_type": "numeric",
        "index": "22",
        "is_ignore": "false",
        "is_row_identifier": "false",
        "is_target": "false",
        "name": "ALOGP2",
        "number_of_missing_values": "0"
      },
      {
        "data_type": "numeric",
        "index": "23",
        "is_ignore": "false",
        "is_row_identifier": "false",
        "is_target": "false",
        "name": "AMR",
        "number_of_missing_values": "0"
      },
      {
        "data_type": "numeric",
        "index": "24",
        "is_ignore": "false",
        "is_row_identifier": "false",
        "is_target": "false",
        "name": "AMW",
        "number_of_missing_values": "0"
      },
      {
        "data_type": "numeric",
        "index": "25",
        "is_ignore": "false",
        "is_row_identifier": "false",
        "is_target": "false",
        "name": "ARR",
        "number_of_missing_values": "0"
      },
      {
        "data_type": "numeric",
        "index": "26",
        "is_ignore": "false",
        "is_row_identifier": "false",
        "is_target": "false",
        "name": "ATS1e",
        "number_of_missing_values": "0"
      },
      {
        "data_type": "numeric",
        "index": "27",
        "is_ignore": "false",
        "is_row_identifier": "false",
        "is_target": "false",
        "name": "ATS1i",
        "number_of_missing_values": "0"
      },
      {
        "data_type": "numeric",
        "index": "28",
        "is_ignore": "false",
        "is_row_identifier": "false",
        "is_target": "false",
        "name": "ATS1m",
        "number_of_missing_values": "0"
      },
      {
        "data_type": "numeric",
        "index": "29",
        "is_ignore": "false",
        "is_row_identifier": "false",
        "is_target": "false",
        "name": "ATS1p",
        "number_of_missing_values": "0"
      },
      {
        "data_type": "numeric",
        "index": "30",
        "is_ignore": "false",
        "is_row_identifier": "false",
        "is_target": "false",
        "name": "ATS1s",
        "number_of_missing_values": "0"
      },
      {
        "data_type": "numeric",
        "index": "31",
        "is_ignore": "false",
        "is_row_identifier": "false",
        "is_target": "false",
        "name": "ATS1v",
        "number_of_missing_values": "0"
      },
      {
        "data_type": "numeric",
        "index": "32",
        "is_ignore": "false",
        "is_row_identifier": "false",
        "is_target": "false",
        "name": "ATS2e",
        "number_of_missing_values": "0"
      },
      {
        "data_type": "numeric",
        "index": "33",
        "is_ignore": "false",
        "is_row_identifier": "false",
        "is_target": "false",
        "name": "ATS2i",
        "number_of_missing_values": "0"
      },
      {
        "data_type": "numeric",
        "index": "34",
        "is_ignore": "false",
        "is_row_identifier": "false",
        "is_target": "false",
        "name": "ATS2m",
        "number_of_missing_values": "0"
      },
      {
        "data_type": "numeric",
        "index": "35",
        "is_ignore": "false",
        "is_row_identifier": "false",
        "is_target": "false",
        "name": "ATS2p",
        "number_of_missing_values": "0"
      },
      {
        "data_type": "numeric",
        "index": "36",
        "is_ignore": "false",
        "is_row_identifier": "false",
        "is_target": "false",
        "name": "ATS2s",
        "number_of_missing_values": "0"
      },
      {
        "data_type": "numeric",
        "index": "37",
        "is_ignore": "false",
        "is_row_identifier": "false",
        "is_target": "false",
        "name": "ATS2v",
        "number_of_missing_values": "0"
      },
      {
        "data_type": "numeric",
        "index": "38",
        "is_ignore": "false",
        "is_row_identifier": "false",
        "is_target": "false",
        "name": "ATS3e",
        "number_of_missing_values": "0"
      },
      {
        "data_type": "numeric",
        "index": "39",
        "is_ignore": "false",
        "is_row_identifier": "false",
        "is_target": "false",
        "name": "ATS3i",
        "number_of_missing_values": "0"
      },
      {
        "data_type": "numeric",
        "index": "40",
        "is_ignore": "false",
        "is_row_identifier": "false",
        "is_target": "false",
        "name": "ATS3m",
        "number_of_missing_values": "0"
      },
      {
        "data_type": "numeric",
        "index": "41",
        "is_ignore": "false",
        "is_row_identifier": "false",
        "is_target": "false",
        "name": "ATS3p",
        "number_of_missing_values": "0"
      },
      {
        "data_type": "numeric",
        "index": "42",
        "is_ignore": "false",
        "is_row_identifier": "false",
        "is_target": "false",
        "name": "ATS3s",
        "number_of_missing_values": "0"
      },
      {
        "data_type": "numeric",
        "index": "43",
        "is_ignore": "false",
        "is_row_identifier": "false",
        "is_target": "false",
        "name": "ATS3v",
        "number_of_missing_values": "0"
      },
      {
        "data_type": "numeric",
        "index": "44",
        "is_ignore": "false",
        "is_row_identifier": "false",
        "is_target": "false",
        "name": "ATS4e",
        "number_of_missing_values": "0"
      },
      {
        "data_type": "numeric",
        "index": "45",
        "is_ignore": "false",
        "is_row_identifier": "false",
        "is_target": "false",
        "name": "ATS4i",
        "number_of_missing_values": "0"
      },
      {
        "data_type": "numeric",
        "index": "46",
        "is_ignore": "false",
        "is_row_identifier": "false",
        "is_target": "false",
        "name": "ATS4m",
        "number_of_missing_values": "0"
      },
      {
        "data_type": "numeric",
        "index": "47",
        "is_ignore": "false",
        "is_row_identifier": "false",
        "is_target": "false",
        "name": "ATS4p",
        "number_of_missing_values": "0"
      },
      {
        "data_type": "numeric",
        "index": "48",
        "is_ignore": "false",
        "is_row_identifier": "false",
        "is_target": "false",
        "name": "ATS4s",
        "number_of_missing_values": "0"
      },
      {
        "data_type": "numeric",
        "index": "49",
        "is_ignore": "false",
        "is_row_identifier": "false",
        "is_target": "false",
        "name": "ATS4v",
        "number_of_missing_values": "0"
      },
      {
        "data_type": "numeric",
        "index": "50",
        "is_ignore": "false",
        "is_row_identifier": "false",
        "is_target": "false",
        "name": "ATS5e",
        "number_of_missing_values": "0"
      },
      {
        "data_type": "numeric",
        "index": "51",
        "is_ignore": "false",
        "is_row_identifier": "false",
        "is_target": "false",
        "name": "ATS5i",
        "number_of_missing_values": "0"
      },
      {
        "data_type": "numeric",
        "index": "52",
        "is_ignore": "false",
        "is_row_identifier": "false",
        "is_target": "false",
        "name": "ATS5m",
        "number_of_missing_values": "0"
      },
      {
        "data_type": "numeric",
        "index": "53",
        "is_ignore": "false",
        "is_row_identifier": "false",
        "is_target": "false",
        "name": "ATS5p",
        "number_of_missing_values": "0"
      },
      {
        "data_type": "numeric",
        "index": "54",
        "is_ignore": "false",
        "is_row_identifier": "false",
        "is_target": "false",
        "name": "ATS5s",
        "number_of_missing_values": "0"
      },
      {
        "data_type": "numeric",
        "index": "55",
        "is_ignore": "false",
        "is_row_identifier": "false",
        "is_target": "false",
        "name": "ATS5v",
        "number_of_missing_values": "0"
      },
      {
        "data_type": "numeric",
        "index": "56",
        "is_ignore": "false",
        "is_row_identifier": "false",
        "is_target": "false",
        "name": "ATS6e",
        "number_of_missing_values": "0"
      },
      {
        "data_type": "numeric",
        "index": "57",
        "is_ignore": "false",
        "is_row_identifier": "false",
        "is_target": "false",
        "name": "ATS6i",
        "number_of_missing_values": "0"
      },
      {
        "data_type": "numeric",
        "index": "58",
        "is_ignore": "false",
        "is_row_identifier": "false",
        "is_target": "false",
        "name": "ATS6m",
        "number_of_missing_values": "0"
      },
      {
        "data_type": "numeric",
        "index": "59",
        "is_ignore": "false",
        "is_row_identifier": "false",
        "is_target": "false",
        "name": "ATS6p",
        "number_of_missing_values": "0"
      },
      {
        "data_type": "numeric",
        "index": "60",
        "is_ignore": "false",
        "is_row_identifier": "false",
        "is_target": "false",
        "name": "ATS6s",
        "number_of_missing_values": "0"
      },
      {
        "data_type": "numeric",
        "index": "61",
        "is_ignore": "false",
        "is_row_identifier": "false",
        "is_target": "false",
        "name": "ATS6v",
        "number_of_missing_values": "0"
      },
      {
        "data_type": "numeric",
        "index": "62",
        "is_ignore": "false",
        "is_row_identifier": "false",
        "is_target": "false",
        "name": "ATS7e",
        "number_of_missing_values": "0"
      },
      {
        "data_type": "numeric",
        "index": "63",
        "is_ignore": "false",
        "is_row_identifier": "false",
        "is_target": "false",
        "name": "ATS7i",
        "number_of_missing_values": "0"
      },
      {
        "data_type": "numeric",
        "index": "64",
        "is_ignore": "false",
        "is_row_identifier": "false",
        "is_target": "false",
        "name": "ATS7m",
        "number_of_missing_values": "0"
      },
      {
        "data_type": "numeric",
        "index": "65",
        "is_ignore": "false",
        "is_row_identifier": "false",
        "is_target": "false",
        "name": "ATS7p",
        "number_of_missing_values": "0"
      },
      {
        "data_type": "numeric",
        "index": "66",
        "is_ignore": "false",
        "is_row_identifier": "false",
        "is_target": "false",
        "name": "ATS7s",
        "number_of_missing_values": "0"
      },
      {
        "data_type": "numeric",
        "index": "67",
        "is_ignore": "false",
        "is_row_identifier": "false",
        "is_target": "false",
        "name": "ATS7v",
        "number_of_missing_values": "0"
      },
      {
        "data_type": "numeric",
        "index": "68",
        "is_ignore": "false",
        "is_row_identifier": "false",
        "is_target": "true",
        "name": "pXC50",
        "number_of_missing_values": "0"
      }
    ]
  }
}