"molecule_id","AMW","C.","H.","Me","Mi","Mp","Mv","MW","N.","nAB","nAT","nB","nBM","nBO","nBR","nBT","nC","nCL","nCsp","nCsp2","nCsp3","nDB","nF","nH","nHet","nHM","nI","nN","nO","nP","nS","nSK","nTB","nX","O.","RBF","RBN","SCBO","Se","Si","Sp","Sv","X.","pXC50"
{1 11.496,2 43.2,3 35.1,4 1.023,5 1.103,6 0.773,7 0.723,8 425.35,9 5.4,10 10,11 37,13 14,14 26,15 1,16 39,17 16,20 13,21 3,22 4,24 13,25 8,26 3,28 2,29 3,31 2,32 24,34 1,35 8.1,36 0.103,37 4,38 35,39 37.869,40 40.798,41 28.591,42 26.747,43 2.7,44 7.481}
{0 CHEMBL137860,1 9.372,2 45,3 37.5,4 1.019,5 1.11,6 0.73,7 0.697,8 374.87,9 5,10 11,11 40,13 15,14 27,16 42,17 18,18 1,20 15,21 3,22 4,24 15,25 7,26 2,28 2,29 3,31 1,32 25,34 1,35 7.5,36 0.095,37 4,38 36.5,39 40.771,40 44.395,41 29.21,42 27.889,43 2.5,44 7.456}
{0 CHEMBL137895,1 8.7,2 46.7,3 37.8,4 1.012,5 1.11,6 0.719,7 0.691,8 391.48,9 6.7,10 16,11 45,13 20,14 31,16 48,17 21,20 18,21 3,22 4,24 17,25 7,26 1,28 3,29 3,31 1,32 28,35 6.7,36 0.083,37 4,38 43,39 45.549,40 49.95,41 32.358,42 31.083,44 7.721}
{0 CHEMBL137896,1 8.754,2 43.6,3 38.5,4 1.017,5 1.116,6 0.708,7 0.681,8 341.42,9 7.7,10 11,11 39,13 15,14 26,16 41,17 17,20 14,21 3,22 4,24 15,25 7,26 1,28 3,29 3,31 1,32 24,35 7.7,36 0.098,37 4,38 35.5,39 39.665,40 43.534,41 27.597,42 26.557,44 6.77}
{0 CHEMBL137965,1 8.511,2 45,3 40,4 1.011,5 1.111,6 0.709,7 0.677,8 340.43,9 5,10 11,11 40,13 15,14 26,16 42,17 18,20 15,21 3,22 4,24 16,25 6,26 1,28 2,29 3,31 1,32 24,35 7.5,36 0.095,37 4,38 35.5,39 40.447,40 44.451,41 28.352,42 27.062,44 7.42}
{0 CHEMBL137986,1 9.822,2 45,3 35,4 1.032,5 1.118,6 0.729,7 0.707,8 392.86,9 5,10 11,11 40,13 15,14 28,16 42,17 18,18 1,20 15,21 3,22 4,23 1,24 14,25 8,26 2,28 2,29 3,31 1,32 26,34 2,35 7.5,36 0.095,37 4,38 37.5,39 41.284,40 44.735,41 29.148,42 28.273,43 5,44 7.444}
{0 CHEMBL138234,1 11.496,2 43.2,3 35.1,4 1.023,5 1.103,6 0.773,7 0.723,8 425.35,9 5.4,10 10,11 37,13 14,14 26,15 1,16 39,17 16,20 13,21 3,22 4,24 13,25 8,26 3,28 2,29 3,31 2,32 24,34 1,35 8.1,36 0.103,37 4,38 35,39 37.869,40 40.798,41 28.591,42 26.747,43 2.7,44 8.097}
{0 CHEMBL138320,1 8.991,2 46.8,3 38.3,4 1.009,5 1.102,6 0.74,7 0.697,8 422.56,9 4.3,10 16,11 47,13 20,14 32,16 50,17 22,20 19,21 3,22 4,24 18,25 7,26 2,28 2,29 3,31 2,32 29,35 6.4,36 0.1,37 5,38 44,39 47.407,40 51.786,41 34.762,42 32.776,44 7.796}
{0 CHEMBL138392,1 9.364,2 43.2,3 37.8,4 1.017,5 1.107,6 0.736,7 0.695,8 346.46,9 5.4,10 10,11 37,13 14,14 25,16 39,17 16,20 13,21 3,22 4,24 14,25 7,26 2,28 2,29 3,31 2,32 23,35 8.1,36 0.103,37 4,38 34,39 37.64,40 40.956,41 27.239,42 25.722,44 7.051}
{0 CHEMBL138423,1 10.037,2 41,3 33.3,4 1.039,5 1.114,6 0.728,7 0.709,8 391.46,9 7.7,10 10,11 39,13 16,14 28,16 41,17 16,20 13,21 3,22 6,24 13,25 10,26 2,28 3,29 5,31 2,32 26,35 12.8,36 0.122,37 5,38 39,39 40.513,40 43.458,41 28.392,42 27.646,44 7.268}
{0 CHEMBL138470,1 9.741,2 45.5,3 36.4,4 1.014,5 1.098,6 0.765,7 0.714,8 428.59,9 4.5,10 15,11 44,13 19,14 31,16 47,17 20,20 17,21 3,22 4,24 16,25 8,26 3,28 2,29 3,31 3,32 28,35 6.8,36 0.106,37 5,38 42.5,39 44.6,40 48.291,41 33.648,42 31.436,44 7.377}
{0 CHEMBL138479,1 8.377,2 41.5,3 41.5,4 1.013,5 1.121,6 0.692,7 0.661,8 343.44,9 7.3,10 10,11 41,13 14,14 26,16 43,17 17,20 13,21 4,22 4,24 17,25 7,26 1,28 3,29 3,31 1,32 24,35 7.3,36 0.093,37 4,38 35,39 41.549,40 45.95,41 28.358,42 27.083,44 7.538}
{0 CHEMBL138589,1 8.344,2 41.7,3 41.7,4 1.018,5 1.119,6 0.683,7 0.657,8 400.49,9 4.2,10 11,11 48,13 15,14 30,16 50,17 20,20 15,21 5,22 4,24 20,25 8,26 1,28 2,29 5,31 1,32 28,35 10.4,36 0.12,37 6,38 39.5,39 48.869,40 53.7,41 32.784,42 31.545,44 7.678}
{0 CHEMBL138612,1 11.062,2 43.2,3 35.1,4 1.03,5 1.11,6 0.74,7 0.71,8 409.28,9 5.4,10 10,11 37,13 14,14 26,15 1,16 39,17 16,20 13,21 3,22 4,24 13,25 8,26 2,28 2,29 4,31 1,32 24,34 1,35 10.8,36 0.103,37 4,38 35,39 38.12,40 41.087,41 27.398,42 26.275,43 2.7,44 7.387}
{0 CHEMBL138725,1 9.533,2 43.9,3 36.6,4 1.027,5 1.112,6 0.724,7 0.698,8 390.87,9 4.9,10 11,11 41,13 15,14 28,16 43,17 18,18 1,20 15,21 3,22 4,24 15,25 8,26 2,28 2,29 4,31 1,32 26,34 1,35 9.8,36 0.093,37 4,38 37.5,39 42.098,40 45.605,41 29.665,42 28.604,43 2.4,44 7.824}
{0 CHEMBL138974,1 8.181,2 42.6,3 42.6,4 1.012,5 1.117,6 0.688,7 0.656,8 384.49,9 4.3,10 11,11 47,13 15,14 29,16 49,17 20,20 15,21 5,22 4,24 20,25 7,26 1,28 2,29 4,31 1,32 27,35 8.5,36 0.122,37 6,38 38.5,39 47.542,40 52.491,41 32.33,42 30.83,44 7.824}
{0 CHEMBL139059,1 11.496,2 43.2,3 35.1,4 1.023,5 1.103,6 0.773,7 0.723,8 425.35,9 5.4,10 10,11 37,13 14,14 26,15 1,16 39,17 16,20 13,21 3,22 4,24 13,25 8,26 3,28 2,29 3,31 2,32 24,34 1,35 8.1,36 0.103,37 4,38 35,39 37.869,40 40.798,41 28.591,42 26.747,43 2.7,44 7.292}
{0 CHEMBL140709,1 10.233,2 45,3 35,4 1.027,5 1.108,6 0.752,7 0.718,8 409.31,9 5,10 11,11 40,13 15,14 28,16 42,17 18,18 2,20 15,21 3,22 4,24 14,25 8,26 3,28 2,29 3,31 1,32 26,34 2,35 7.5,36 0.095,37 4,38 37.5,39 41.095,40 44.339,41 30.068,42 28.717,43 5,44 8}
{0 CHEMBL140950,1 9.177,2 42.9,3 35.7,4 1.031,5 1.118,6 0.703,7 0.69,8 385.43,9 7.1,10 11,11 42,13 17,14 29,16 44,17 18,20 15,21 3,22 6,24 15,25 9,26 1,28 3,29 5,31 1,32 27,35 11.9,36 0.114,37 5,38 40.5,39 43.32,40 46.953,41 29.506,42 28.986,44 7.222}
{0 CHEMBL141580,1 9.177,2 42.9,3 35.7,4 1.031,5 1.118,6 0.703,7 0.69,8 385.43,9 7.1,10 11,11 42,13 17,14 29,16 44,17 18,20 15,21 3,22 6,24 15,25 9,26 1,28 3,29 5,31 1,32 27,35 11.9,36 0.114,37 5,38 40.5,39 43.32,40 46.953,41 29.506,42 28.986,44 7.119}
{0 CHEMBL141722,1 8.331,2 48,3 40,4 1.004,5 1.106,6 0.718,7 0.682,8 416.53,9 4,10 17,11 50,13 21,14 33,16 53,17 24,20 21,21 3,22 4,24 20,25 6,26 1,28 2,29 3,31 1,32 30,35 6,36 0.094,37 5,38 45.5,39 50.214,40 55.282,41 35.875,42 34.116,44 7.432}
{0 CHEMBL141723,1 9.012,2 42.5,3 40,4 1.013,5 1.109,6 0.725,7 0.681,8 360.49,9 5,10 10,11 40,13 14,14 26,16 42,17 17,20 13,21 4,22 4,24 16,25 7,26 2,28 2,29 3,31 2,32 24,35 7.5,36 0.095,37 4,38 35,39 40.524,40 44.371,41 29,42 27.249,44 7.481}
{0 CHEMBL142062,1 10.483,2 45,3 37.5,4 1.017,5 1.107,6 0.743,7 0.702,8 419.32,9 5,10 11,11 40,13 15,14 27,15 1,16 42,17 18,20 15,21 3,22 4,24 15,25 7,26 2,28 2,29 3,31 1,32 25,34 1,35 7.5,36 0.095,37 4,38 36.5,39 40.676,40 44.293,41 29.705,42 28.087,43 2.5,44 7.409}
{0 CHEMBL336660,1 8.772,2 45.2,3 38.1,4 1.018,5 1.111,6 0.71,7 0.685,8 368.44,9 4.8,10 11,11 42,13 16,14 28,16 44,17 19,20 16,21 3,22 5,24 16,25 7,26 1,28 2,29 4,31 1,32 26,35 9.5,36 0.114,37 5,38 38.5,39 42.774,40 46.661,41 29.807,42 28.777,44 7.027}
{0 CHEMBL341568,1 8.243,2 44.2,3 41.9,4 1.008,5 1.113,6 0.7,7 0.665,8 354.46,9 4.7,10 11,11 43,13 15,14 27,16 45,17 19,20 15,21 4,22 4,24 18,25 6,26 1,28 2,29 3,31 1,32 25,35 7,36 0.089,37 4,38 36.5,39 43.331,40 47.866,41 30.114,42 28.589,44 7.444}
{0 CHEMBL341787,1 9.41,2 45,3 35,4 1.037,5 1.128,6 0.706,7 0.696,8 376.41,9 5,10 11,11 40,13 15,14 28,16 42,17 18,20 15,21 3,22 4,23 2,24 14,25 8,26 1,28 2,29 3,31 1,32 26,34 2,35 7.5,36 0.095,37 4,38 37.5,39 41.473,40 45.131,41 28.227,42 27.829,43 5,44 7.222}
{0 CHEMBL341960,1 7.99,2 41.7,3 43.8,4 1.007,5 1.12,6 0.685,7 0.649,8 383.51,9 6.3,10 11,11 48,13 15,14 29,16 50,17 20,20 15,21 5,22 4,24 21,25 7,26 1,28 3,29 3,31 1,32 27,35 6.3,36 0.1,37 5,38 38.5,39 48.316,40 53.78,41 32.881,42 31.137,44 7.42}
{0 CHEMBL342608,1 8.344,2 41.7,3 41.7,4 1.018,5 1.119,6 0.683,7 0.657,8 400.49,9 4.2,10 11,11 48,13 15,14 30,16 50,17 20,20 15,21 5,22 4,24 20,25 8,26 1,28 2,29 5,31 1,32 28,35 10.4,36 0.12,37 6,38 39.5,39 48.869,40 53.7,41 32.784,42 31.545,44 6.745}
{0 CHEMBL342811,1 8.71,2 41.9,3 41.9,4 1.009,5 1.111,6 0.715,7 0.669,8 374.52,9 4.7,10 10,11 43,13 14,14 27,16 45,17 18,20 13,21 5,22 4,24 18,25 7,26 2,28 2,29 3,31 2,32 25,35 7,36 0.089,37 4,38 36,39 43.407,40 47.786,41 30.762,42 28.776,44 8.155}
{0 CHEMBL343810,1 11.496,2 43.2,3 35.1,4 1.023,5 1.103,6 0.773,7 0.723,8 425.35,9 5.4,10 10,11 37,13 14,14 26,15 1,16 39,17 16,20 13,21 3,22 4,24 13,25 8,26 3,28 2,29 3,31 2,32 24,34 1,35 8.1,36 0.103,37 4,38 35,39 37.869,40 40.798,41 28.591,42 26.747,43 2.7,44 7.237}
{0 CHEMBL343931,1 10.295,2 43.2,3 35.1,4 1.026,5 1.105,6 0.759,7 0.718,8 380.9,9 5.4,10 10,11 37,13 14,14 26,16 39,17 16,18 1,20 13,21 3,22 4,24 13,25 8,26 3,28 2,29 3,31 2,32 24,34 1,35 8.1,36 0.103,37 4,38 35,39 37.964,40 40.9,41 28.097,42 26.55,43 2.7,44 7.77}
{0 CHEMBL423541,1 9.012,2 42.5,3 40,4 1.013,5 1.109,6 0.725,7 0.681,8 360.49,9 5,10 10,11 40,13 14,14 26,16 42,17 17,20 13,21 4,22 4,24 16,25 7,26 2,28 2,29 3,31 2,32 24,35 7.5,36 0.095,37 4,38 35,39 40.524,40 44.371,41 29,42 27.249,44 6.538}
{0 CHEMBL423552,1 9.372,2 45,3 37.5,4 1.019,5 1.11,6 0.73,7 0.697,8 374.87,9 5,10 11,11 40,13 15,14 27,16 42,17 18,18 1,20 15,21 3,22 4,24 15,25 7,26 2,28 2,29 3,31 1,32 25,34 1,35 7.5,36 0.095,37 4,38 36.5,39 40.771,40 44.395,41 29.21,42 27.889,43 2.5,44 7.377}
