{
  "data_features": {
    "feature": [
      {
        "data_type": "nominal",
        "index": "0",
        "is_ignore": "false",
        "is_row_identifier": "true",
        "is_target": "false",
        "name": "molecule_id",
        "nominal_value": [
          "CHEMBL1303708",
          "CHEMBL1332248",
          "CHEMBL1341209",
          "CHEMBL1352211",
          "CHEMBL1355336",
          "CHEMBL1358604",
          "CHEMBL1383386",
          "CHEMBL1411002",
          "CHEMBL1413612",
          "CHEMBL1429902",
          "CHEMBL1430252",
          "CHEMBL1441404",
          "CHEMBL1443335",
          "CHEMBL1466549",
          "CHEMBL1482583",
          "CHEMBL1489253",
          "CHEMBL1494524",
          "CHEMBL1537712",
          "CHEMBL1609140",
          "CHEMBL1622737",
          "CHEMBL1703689",
          "CHEMBL1719341",
          "CHEMBL1735216",
          "CHEMBL1867263",
          "CHEMBL1872098",
          "CHEMBL2133808",
          "CHEMBL2134683",
          "CHEMBL2136151",
          "CHEMBL258123",
          "CHEMBL440586",
          "CHEMBL536008"
        ],
        "number_of_missing_values": "0"
      },
      {
        "data_type": "numeric",
        "index": "1",
        "is_ignore": "false",
        "is_row_identifier": "false",
        "is_target": "false",
        "name": "nH",
        "number_of_missing_values": "0"
      },
      {
        "data_type": "numeric",
        "index": "2",
        "is_ignore": "false",
        "is_row_identifier": "false",
        "is_target": "false",
        "name": "N.",
        "number_of_missing_values": "0"
      },
      {
        "data_type": "numeric",
        "index": "3",
        "is_ignore": "false",
        "is_row_identifier": "false",
        "is_target": "false",
        "name": "H.",
        "number_of_missing_values": "0"
      },
      {
        "data_type": "numeric",
        "index": "4",
        "is_ignore": "false",
        "is_row_identifier": "false",
        "is_target": "false",
        "name": "X.",
        "number_of_missing_values": "0"
      },
      {
        "data_type": "numeric",
        "index": "5",
        "is_ignore": "false",
        "is_row_identifier": "false",
        "is_target": "true",
        "name": "pXC50",
        "number_of_missing_values": "0"
      }
    ]
  }
}