{
  "data_features": {
    "feature": [
      {
        "data_type": "nominal",
        "index": "0",
        "is_ignore": "false",
        "is_row_identifier": "true",
        "is_target": "false",
        "name": "molecule_id",
        "nominal_value": [
          "CHEMBL1453126",
          "CHEMBL145352",
          "CHEMBL1617574",
          "CHEMBL1698064",
          "CHEMBL1700271",
          "CHEMBL1705313",
          "CHEMBL1706858",
          "CHEMBL1716096",
          "CHEMBL1719251",
          "CHEMBL1719929",
          "CHEMBL1720543",
          "CHEMBL1721230",
          "CHEMBL1876662",
          "CHEMBL1879618",
          "CHEMBL1882023",
          "CHEMBL2057216",
          "CHEMBL2057929",
          "CHEMBL2057934",
          "CHEMBL2057935",
          "CHEMBL2057938",
          "CHEMBL2057939",
          "CHEMBL2057941",
          "CHEMBL2057942",
          "CHEMBL2057943",
          "CHEMBL2057944",
          "CHEMBL2057945",
          "CHEMBL2057946",
          "CHEMBL2057947",
          "CHEMBL2057948",
          "CHEMBL2057949",
          "CHEMBL2057951",
          "CHEMBL2059403",
          "CHEMBL2059407",
          "CHEMBL409315",
          "CHEMBL442876",
          "CHEMBL446487",
          "CHEMBL447111",
          "CHEMBL447590",
          "CHEMBL447958",
          "CHEMBL448036",
          "CHEMBL448142",
          "CHEMBL448408",
          "CHEMBL448841",
          "CHEMBL448847",
          "CHEMBL448868",
          "CHEMBL448958",
          "CHEMBL449985",
          "CHEMBL450862",
          "CHEMBL452114",
          "CHEMBL452994",
          "CHEMBL453929",
          "CHEMBL455496",
          "CHEMBL459300",
          "CHEMBL459301",
          "CHEMBL459302",
          "CHEMBL459310",
          "CHEMBL459311",
          "CHEMBL459501",
          "CHEMBL459529",
          "CHEMBL459727",
          "CHEMBL459728",
          "CHEMBL459743",
          "CHEMBL459744",
          "CHEMBL459938",
          "CHEMBL459939",
          "CHEMBL459940",
          "CHEMBL460347",
          "CHEMBL460348",
          "CHEMBL460353",
          "CHEMBL460354",
          "CHEMBL460563",
          "CHEMBL460570",
          "CHEMBL460571",
          "CHEMBL460572",
          "CHEMBL460581",
          "CHEMBL460582",
          "CHEMBL460593",
          "CHEMBL460782",
          "CHEMBL460783",
          "CHEMBL460784",
          "CHEMBL460792",
          "CHEMBL460801",
          "CHEMBL460802",
          "CHEMBL460803",
          "CHEMBL460804",
          "CHEMBL460982",
          "CHEMBL460993",
          "CHEMBL460994",
          "CHEMBL460995",
          "CHEMBL461009",
          "CHEMBL461010",
          "CHEMBL461208",
          "CHEMBL461209",
          "CHEMBL461424",
          "CHEMBL461633",
          "CHEMBL461634",
          "CHEMBL461635",
          "CHEMBL461839",
          "CHEMBL461840",
          "CHEMBL461841",
          "CHEMBL461842",
          "CHEMBL461850",
          "CHEMBL461851",
          "CHEMBL461852",
          "CHEMBL462049",
          "CHEMBL462051",
          "CHEMBL462059",
          "CHEMBL462260",
          "CHEMBL462261",
          "CHEMBL462689",
          "CHEMBL462690",
          "CHEMBL462696",
          "CHEMBL466002",
          "CHEMBL466003",
          "CHEMBL466004",
          "CHEMBL466178",
          "CHEMBL466179",
          "CHEMBL466206",
          "CHEMBL466401",
          "CHEMBL467217",
          "CHEMBL467237",
          "CHEMBL467238",
          "CHEMBL467239",
          "CHEMBL467423",
          "CHEMBL467435",
          "CHEMBL467436",
          "CHEMBL467645",
          "CHEMBL467646",
          "CHEMBL467848",
          "CHEMBL467849",
          "CHEMBL467858",
          "CHEMBL467859",
          "CHEMBL467863",
          "CHEMBL468059",
          "CHEMBL468072",
          "CHEMBL468073",
          "CHEMBL468074",
          "CHEMBL468471",
          "CHEMBL468480",
          "CHEMBL468481",
          "CHEMBL468490",
          "CHEMBL468491",
          "CHEMBL468683",
          "CHEMBL468691",
          "CHEMBL468890",
          "CHEMBL468891",
          "CHEMBL468905",
          "CHEMBL468909",
          "CHEMBL469106",
          "CHEMBL469109",
          "CHEMBL469118",
          "CHEMBL475281",
          "CHEMBL498855",
          "CHEMBL500208",
          "CHEMBL500760",
          "CHEMBL500986",
          "CHEMBL502103",
          "CHEMBL503254",
          "CHEMBL503504",
          "CHEMBL504500",
          "CHEMBL504860",
          "CHEMBL505114",
          "CHEMBL505863",
          "CHEMBL506221",
          "CHEMBL506724",
          "CHEMBL508178",
          "CHEMBL509657",
          "CHEMBL509918",
          "CHEMBL510282",
          "CHEMBL510354",
          "CHEMBL511180",
          "CHEMBL511207",
          "CHEMBL511372",
          "CHEMBL511379",
          "CHEMBL511913",
          "CHEMBL511935",
          "CHEMBL512048",
          "CHEMBL512049",
          "CHEMBL512214",
          "CHEMBL512260",
          "CHEMBL512261",
          "CHEMBL512561",
          "CHEMBL512761",
          "CHEMBL512985",
          "CHEMBL513144",
          "CHEMBL513348",
          "CHEMBL513482",
          "CHEMBL513531",
          "CHEMBL516484",
          "CHEMBL516612",
          "CHEMBL516778",
          "CHEMBL517101",
          "CHEMBL517107",
          "CHEMBL517260",
          "CHEMBL517724",
          "CHEMBL517857",
          "CHEMBL517894",
          "CHEMBL518027",
          "CHEMBL518188",
          "CHEMBL518634",
          "CHEMBL518673",
          "CHEMBL518797",
          "CHEMBL541931",
          "CHEMBL568769",
          "CHEMBL568994",
          "CHEMBL568995",
          "CHEMBL568996",
          "CHEMBL569164",
          "CHEMBL569165",
          "CHEMBL569384",
          "CHEMBL570293",
          "CHEMBL570294",
          "CHEMBL570986",
          "CHEMBL571611",
          "CHEMBL571827",
          "CHEMBL571828",
          "CHEMBL571874",
          "CHEMBL572060",
          "CHEMBL572065",
          "CHEMBL577095",
          "CHEMBL577297",
          "CHEMBL578390",
          "CHEMBL583347"
        ],
        "number_of_missing_values": "0"
      },
      {
        "data_type": "numeric",
        "index": "1",
        "is_ignore": "false",
        "is_row_identifier": "false",
        "is_target": "false",
        "name": "C.",
        "number_of_missing_values": "0"
      },
      {
        "data_type": "numeric",
        "index": "2",
        "is_ignore": "false",
        "is_row_identifier": "false",
        "is_target": "false",
        "name": "N.",
        "number_of_missing_values": "0"
      },
      {
        "data_type": "numeric",
        "index": "3",
        "is_ignore": "false",
        "is_row_identifier": "false",
        "is_target": "false",
        "name": "nHet",
        "number_of_missing_values": "0"
      },
      {
        "data_type": "numeric",
        "index": "4",
        "is_ignore": "false",
        "is_row_identifier": "false",
        "is_target": "false",
        "name": "nN",
        "number_of_missing_values": "0"
      },
      {
        "data_type": "numeric",
        "index": "5",
        "is_ignore": "false",
        "is_row_identifier": "false",
        "is_target": "false",
        "name": "Mi",
        "number_of_missing_values": "0"
      },
      {
        "data_type": "numeric",
        "index": "6",
        "is_ignore": "false",
        "is_row_identifier": "false",
        "is_target": "false",
        "name": "RBF",
        "number_of_missing_values": "0"
      },
      {
        "data_type": "numeric",
        "index": "7",
        "is_ignore": "false",
        "is_row_identifier": "false",
        "is_target": "false",
        "name": "AMW",
        "number_of_missing_values": "0"
      },
      {
        "data_type": "numeric",
        "index": "8",
        "is_ignore": "false",
        "is_row_identifier": "false",
        "is_target": "false",
        "name": "H.",
        "number_of_missing_values": "0"
      },
      {
        "data_type": "numeric",
        "index": "9",
        "is_ignore": "false",
        "is_row_identifier": "false",
        "is_target": "false",
        "name": "Me",
        "number_of_missing_values": "0"
      },
      {
        "data_type": "numeric",
        "index": "10",
        "is_ignore": "false",
        "is_row_identifier": "false",
        "is_target": "true",
        "name": "pXC50",
        "number_of_missing_values": "0"
      }
    ]
  }
}