{
  "data_set_description": {
    "collection_date": "November 2013",
    "creator": "Dr Jeremy Besnard, Dr Ivan Olier, Dr Noureddin Sadawi, Dr Larisa Soldatova, Dr Crina Grosan, Prof Ross King, Dr Richard Bickerton, Prof Andrew Hopkins and Dr Willem van Hoorn",
    "default_target_attribute": "pXC50",
    "description": "This dataset contains QSAR data (from ChEMBL version 17) showing activity values (unit is pseudo-pCI50) of several compounds on drug target ChEMBL_ID: CHEMBL6088 (TID: 101439), and it has 35 rows and 1235 features (not including molecule IDs and class feature: molecule_id and pXC50). The features represent Molecular Descriptors which were generated from SMILES strings. Missing value imputation was applied to this dataset (By choosing the Median).",
    "description_version": "1",
    "file_id": "3602435",
    "format": "ARFF",
    "id": "37008",
    "licence": "Public",
    "md5_checksum": "c332cb1e682ca3fec787621cc35c57d5",
    "minio_url": "https://data.openml.org/datasets/0003/37008/dataset_37008.pq",
    "name": "QSAR-DATASET-FOR-DRUG-TARGET-CHEMBL6088",
    "original_data_url": "https://www.ebi.ac.uk/chembl/target/inspect/CHEMBL6088",
    "parquet_url": "https://data.openml.org/datasets/0003/37008/dataset_37008.pq",
    "processing_date": "2018-10-04 05:03:20",
    "row_id_attribute": "molecule_id",
    "status": "deactivated",
    "tag": [
      "MetaQSAR",
      "study_13"
    ],
    "upload_date": "2016-07-15T23:10:38",
    "url": "https://api.openml.org/data/v1/download/3602435/QSAR-DATASET-FOR-DRUG-TARGET-CHEMBL6088.arff",
    "version": "11",
    "visibility": "public"
  }
}