"molecule_id","FCFP4_1024b451","FCFP4_1024b352","FCFP4_1024b821","FCFP4_1024b937","FCFP4_1024b626","FCFP4_1024b453","FCFP4_1024b492","FCFP4_1024b283","FCFP4_1024b107","FCFP4_1024b54","FCFP4_1024b899","FCFP4_1024b714","FCFP4_1024b1010","FCFP4_1024b617","FCFP4_1024b668","FCFP4_1024b557","FCFP4_1024b520","FCFP4_1024b33","FCFP4_1024b201","FCFP4_1024b649","FCFP4_1024b142","FCFP4_1024b429","FCFP4_1024b108","FCFP4_1024b300","FCFP4_1024b862","FCFP4_1024b574","FCFP4_1024b723","FCFP4_1024b61","FCFP4_1024b902","FCFP4_1024b1","FCFP4_1024b10","FCFP4_1024b100","FCFP4_1024b1000","FCFP4_1024b1001","FCFP4_1024b1002","FCFP4_1024b1003","FCFP4_1024b1004","FCFP4_1024b1005","FCFP4_1024b1006","FCFP4_1024b1007","FCFP4_1024b1008","FCFP4_1024b1009","FCFP4_1024b101","FCFP4_1024b1011","FCFP4_1024b1012","FCFP4_1024b1013","FCFP4_1024b1014","FCFP4_1024b1015","FCFP4_1024b1016","FCFP4_1024b1017","FCFP4_1024b1018","pXC50"
{7 1,9 1,10 1,15 1,30 1,52 6.638}
{0 CHEMBL13076,2 1,3 1,6 1,8 1,9 1,10 1,15 1,18 1,30 1,52 7}
{0 CHEMBL13378,4 1,7 1,12 1,15 1,30 1,52 6.131}
{0 CHEMBL14935,4 1,12 1,15 1,22 1,25 1,26 1,30 1,52 5.379}
{0 CHEMBL152064,1 1,2 1,3 1,5 1,6 1,8 1,9 1,10 1,11 1,13 1,18 1,20 1,24 1,30 1,52 4.854}
{0 CHEMBL152120,1 1,2 1,3 1,5 1,6 1,8 1,9 1,10 1,11 1,13 1,18 1,20 1,22 1,24 1,30 1,52 5.432}
{0 CHEMBL153851,1 1,2 1,3 1,5 1,6 1,8 1,9 1,10 1,11 1,13 1,18 1,20 1,22 1,24 1,30 1,52 5}
{0 CHEMBL153891,2 1,3 1,5 1,9 1,10 1,11 1,12 1,13 1,18 1,20 1,24 1,26 1,30 1,52 4}
{0 CHEMBL154022,1 1,2 1,3 1,5 1,6 1,8 1,9 1,10 1,13 1,15 1,18 1,24 1,30 1,52 4}
{0 CHEMBL154066,1 1,2 1,3 1,5 1,6 1,8 1,9 1,10 1,11 1,13 1,18 1,20 1,24 1,30 1,52 5.509}
{0 CHEMBL154202,1 1,2 1,3 1,5 1,6 1,9 1,10 1,11 1,13 1,18 1,20 1,24 1,30 1,52 5.328}
{0 CHEMBL154290,1 1,2 1,3 1,5 1,8 1,9 1,10 1,11 1,13 1,18 1,20 1,24 1,30 1,52 4.056}
{0 CHEMBL154658,1 1,2 1,3 1,5 1,6 1,8 1,9 1,10 1,11 1,13 1,18 1,20 1,24 1,30 1,52 5.658}
{0 CHEMBL154678,1 1,2 1,3 1,5 1,9 1,10 1,11 1,13 1,18 1,20 1,24 1,30 1,52 4.509}
{0 CHEMBL154696,1 1,2 1,3 1,5 1,6 1,8 1,9 1,10 1,11 1,13 1,15 1,18 1,20 1,24 1,30 1,52 5.301}
{0 CHEMBL154700,1 1,2 1,3 1,5 1,6 1,8 1,9 1,10 1,11 1,13 1,18 1,20 1,24 1,30 1,52 4.523}
{0 CHEMBL154701,1 1,2 1,3 1,5 1,6 1,9 1,10 1,11 1,13 1,18 1,20 1,24 1,30 1,52 5}
{0 CHEMBL154704,1 1,2 1,3 1,5 1,6 1,8 1,9 1,10 1,11 1,13 1,18 1,20 1,24 1,30 1,52 5.886}
{0 CHEMBL154878,1 1,2 1,3 1,5 1,6 1,8 1,9 1,10 1,13 1,15 1,18 1,24 1,30 1,52 4}
{0 CHEMBL154960,1 1,2 1,3 1,5 1,6 1,9 1,10 1,11 1,13 1,18 1,20 1,24 1,30 1,52 4.161}
{0 CHEMBL155022,1 1,2 1,3 1,5 1,6 1,8 1,9 1,10 1,11 1,13 1,18 1,20 1,24 1,30 1,52 5.658}
{0 CHEMBL155062,1 1,2 1,3 1,5 1,6 1,8 1,9 1,10 1,11 1,13 1,18 1,20 1,24 1,30 1,52 4.523}
{0 CHEMBL155081,1 1,2 1,3 1,5 1,6 1,9 1,10 1,11 1,13 1,18 1,20 1,24 1,30 1,52 5.301}
{0 CHEMBL155101,1 1,2 1,3 1,5 1,6 1,8 1,9 1,10 1,11 1,13 1,18 1,20 1,24 1,30 1,52 5.328}
{0 CHEMBL155190,1 1,2 1,3 1,5 1,6 1,9 1,10 1,11 1,13 1,18 1,20 1,24 1,30 1,52 5.347}
{0 CHEMBL155261,1 1,2 1,3 1,5 1,6 1,8 1,9 1,10 1,11 1,13 1,18 1,20 1,24 1,30 1,52 5}
{0 CHEMBL155492,1 1,2 1,3 1,5 1,6 1,9 1,10 1,11 1,13 1,18 1,20 1,24 1,30 1,52 5.347}
{0 CHEMBL155527,1 1,2 1,3 1,5 1,6 1,9 1,10 1,11 1,13 1,18 1,20 1,24 1,30 1,52 4.699}
{0 CHEMBL155535,1 1,2 1,3 1,5 1,6 1,9 1,10 1,11 1,13 1,18 1,20 1,24 1,30 1,52 5.027}
{0 CHEMBL155581,1 1,2 1,3 1,5 1,9 1,10 1,11 1,13 1,18 1,20 1,24 1,30 1,52 4.745}
{0 CHEMBL156464,1 1,2 1,3 1,5 1,6 1,8 1,9 1,10 1,13 1,15 1,18 1,24 1,30 1,52 4}
{0 CHEMBL156519,1 1,2 1,3 1,5 1,6 1,8 1,9 1,10 1,13 1,15 1,18 1,24 1,30 1,52 4.143}
{0 CHEMBL156667,1 1,2 1,3 1,5 1,6 1,8 1,9 1,10 1,11 1,13 1,18 1,20 1,24 1,30 1,52 4.444}
{0 CHEMBL156717,5 1,9 1,10 1,13 1,24 1,30 1,52 5.796}
{0 CHEMBL156768,1 1,2 1,3 1,5 1,9 1,10 1,11 1,13 1,18 1,20 1,24 1,30 1,52 4.292}
{0 CHEMBL157012,1 1,2 1,3 1,5 1,6 1,8 1,9 1,10 1,11 1,13 1,18 1,20 1,24 1,30 1,52 5.119}
{0 CHEMBL157063,1 1,2 1,3 1,5 1,6 1,8 1,9 1,10 1,13 1,24 1,30 1,52 4}
{0 CHEMBL157100,1 1,2 1,3 1,5 1,6 1,9 1,10 1,11 1,13 1,18 1,20 1,24 1,30 1,52 4.678}
{0 CHEMBL157270,1 1,2 1,3 1,5 1,6 1,8 1,9 1,10 1,11 1,13 1,18 1,20 1,24 1,30 1,52 4.921}
{0 CHEMBL187941,6 1,9 1,10 1,12 1,22 1,25 1,26 1,30 1,52 4.498}
{0 CHEMBL189721,12 1,22 1,25 1,26 1,30 1,52 5.133}
{0 CHEMBL189985,4 1,12 1,15 1,22 1,25 1,26 1,30 1,52 5.772}
{0 CHEMBL191249,4 1,6 1,9 1,10 1,12 1,15 1,22 1,25 1,26 1,30 1,52 5.81}
{0 CHEMBL193087,4 1,7 1,12 1,15 1,30 1,52 4.466}
{0 CHEMBL1950805,4 1,12 1,15 1,18 1,30 1,52 6.187}
{0 CHEMBL2111523,4 1,7 1,12 1,14 1,15 1,16 1,17 1,19 1,22 1,25 1,26 1,27 1,30 1,52 6.796}
{0 CHEMBL222519,7 1,30 1,52 4.682}
{0 CHEMBL223927,1 1,2 1,3 1,6 1,8 1,9 1,10 1,11 1,15 1,18 1,20 1,30 1,52 4.523}
{0 CHEMBL223928,1 1,2 1,3 1,5 1,6 1,8 1,9 1,10 1,11 1,13 1,18 1,20 1,24 1,30 1,52 4.921}
{0 CHEMBL224173,1 1,2 1,3 1,4 1,5 1,6 1,8 1,9 1,10 1,11 1,15 1,18 1,20 1,30 1,31 1,52 5.523}
{0 CHEMBL224174,1 1,2 1,3 1,6 1,8 1,9 1,10 1,11 1,18 1,20 1,30 1,52 5.523}
{0 CHEMBL224688,1 1,2 1,3 1,5 1,6 1,8 1,9 1,10 1,11 1,15 1,18 1,20 1,30 1,52 4.523}
{0 CHEMBL224760,1 1,2 1,3 1,6 1,8 1,9 1,10 1,11 1,15 1,18 1,20 1,30 1,52 5.523}
{0 CHEMBL224785,13 1,18 1,20 1,24 1,30 1,41 1,52 4.523}
{0 CHEMBL224831,6 1,8 1,9 1,10 1,11 1,18 1,20 1,30 1,40 1,52 4.301}
{0 CHEMBL224837,1 1,2 1,3 1,5 1,6 1,8 1,9 1,10 1,11 1,15 1,18 1,20 1,26 1,30 1,52 4.523}
{0 CHEMBL224872,1 1,2 1,3 1,5 1,6 1,7 1,8 1,9 1,10 1,11 1,18 1,20 1,30 1,52 4.523}
{0 CHEMBL224926,1 1,2 1,3 1,6 1,8 1,9 1,10 1,11 1,18 1,20 1,30 1,52 4.523}
{0 CHEMBL225123,1 1,2 1,3 1,5 1,6 1,8 1,9 1,10 1,11 1,18 1,20 1,28 1,30 1,52 4.523}
{0 CHEMBL225612,5 1,9 1,10 1,11 1,13 1,18 1,20 1,24 1,30 1,52 4.721}
{0 CHEMBL264709,1 1,2 1,3 1,5 1,6 1,8 1,9 1,10 1,13 1,15 1,18 1,24 1,30 1,52 4.509}
{0 CHEMBL268284,9 1,10 1,15 1,30 1,52 6.276}
{0 CHEMBL274226,4 1,12 1,13 1,15 1,22 1,24 1,25 1,26 1,30 1,52 4.766}
{0 CHEMBL275040,4 1,12 1,15 1,22 1,26 1,30 1,52 4.79}
{0 CHEMBL276815,4 1,7 1,12 1,15 1,30 1,52 5.939}
{0 CHEMBL288166,4 1,7 1,12 1,14 1,15 1,17 1,22 1,25 1,26 1,30 1,52 8.523}
{0 CHEMBL29024,4 1,7 1,12 1,15 1,30 1,52 7}
{0 CHEMBL291491,4 1,7 1,12 1,14 1,15 1,16 1,17 1,18 1,19 1,21 1,22 1,23 1,25 1,26 1,27 1,28 1,29 1,30 1,52 7.284}
{0 CHEMBL292745,4 1,7 1,12 1,14 1,15 1,16 1,17 1,19 1,21 1,22 1,23 1,25 1,26 1,27 1,28 1,29 1,30 1,52 6.764}
{0 CHEMBL292896,4 1,7 1,12 1,14 1,15 1,16 1,17 1,19 1,21 1,22 1,23 1,25 1,26 1,27 1,28 1,29 1,30 1,52 6.876}
{0 CHEMBL293118,4 1,7 1,12 1,14 1,15 1,16 1,17 1,18 1,19 1,21 1,22 1,23 1,25 1,26 1,27 1,28 1,29 1,30 1,52 7.31}
{0 CHEMBL293548,4 1,7 1,12 1,14 1,15 1,16 1,17 1,18 1,19 1,21 1,22 1,23 1,25 1,26 1,27 1,28 1,30 1,52 6.595}
{0 CHEMBL293613,9 1,10 1,13 1,15 1,24 1,30 1,52 5.854}
{0 CHEMBL293829,4 1,7 1,12 1,14 1,15 1,16 1,17 1,19 1,21 1,22 1,23 1,25 1,26 1,27 1,28 1,29 1,30 1,31 1,52 6.435}
{0 CHEMBL294139,4 1,7 1,12 1,14 1,15 1,16 1,17 1,19 1,22 1,25 1,26 1,27 1,30 1,52 5.347}
{0 CHEMBL294683,4 1,7 1,12 1,14 1,15 1,16 1,17 1,18 1,19 1,20 1,21 1,22 1,23 1,25 1,26 1,27 1,28 1,29 1,30 1,52 7.108}
{0 CHEMBL297283,4 1,7 1,12 1,15 1,17 1,18 1,20 1,26 1,28 1,29 1,30 1,52 4.385}
{0 CHEMBL297919,4 1,7 1,12 1,15 1,16 1,17 1,26 1,30 1,52 6.824}
{0 CHEMBL298779,4 1,7 1,12 1,15 1,17 1,26 1,30 1,52 4.857}
{0 CHEMBL298800,4 1,7 1,12 1,15 1,16 1,17 1,22 1,26 1,30 1,52 7.029}
{0 CHEMBL299180,4 1,7 1,12 1,15 1,16 1,17 1,22 1,26 1,30 1,52 7.264}
{0 CHEMBL299291,4 1,7 1,12 1,15 1,16 1,17 1,22 1,26 1,30 1,52 6.818}
{0 CHEMBL299365,4 1,7 1,12 1,15 1,16 1,17 1,22 1,26 1,27 1,30 1,52 6.65}
{0 CHEMBL299449,4 1,7 1,12 1,14 1,15 1,17 1,18 1,19 1,22 1,25 1,26 1,30 1,52 5.834}
{0 CHEMBL300368,4 1,7 1,12 1,14 1,15 1,16 1,17 1,19 1,21 1,22 1,23 1,25 1,26 1,27 1,28 1,29 1,30 1,52 7.495}
{0 CHEMBL300928,4 1,7 1,12 1,15 1,16 1,17 1,26 1,30 1,52 6.292}
{0 CHEMBL301536,4 1,7 1,12 1,14 1,15 1,16 1,17 1,19 1,21 1,22 1,23 1,25 1,26 1,27 1,28 1,29 1,30 1,52 7.83}
{0 CHEMBL301915,4 1,7 1,12 1,14 1,15 1,16 1,17 1,18 1,19 1,20 1,21 1,22 1,23 1,25 1,26 1,27 1,28 1,29 1,30 1,52 7.523}
{0 CHEMBL302402,4 1,7 1,12 1,14 1,15 1,17 1,19 1,22 1,25 1,26 1,30 1,52 5.443}
{0 CHEMBL302680,4 1,6 1,7 1,12 1,14 1,15 1,16 1,17 1,19 1,21 1,22 1,23 1,25 1,26 1,27 1,28 1,29 1,30 1,52 7.237}
{0 CHEMBL303415,9 1,10 1,15 1,26 1,30 1,31 1,52 6.481}
{0 CHEMBL304434,4 1,7 1,12 1,14 1,15 1,16 1,17 1,19 1,22 1,25 1,26 1,27 1,30 1,52 6.793}
{0 CHEMBL305346,4 1,7 1,12 1,14 1,15 1,16 1,17 1,19 1,21 1,22 1,23 1,25 1,26 1,27 1,28 1,29 1,30 1,52 7.398}
{0 CHEMBL305387,4 1,7 1,12 1,14 1,15 1,17 1,19 1,22 1,25 1,26 1,30 1,52 5.924}
{0 CHEMBL305534,9 1,10 1,15 1,26 1,30 1,52 5.62}
{0 CHEMBL33891,1 1,2 1,3 1,6 1,8 1,9 1,10 1,11 1,15 1,18 1,20 1,30 1,52 4.523}
{0 CHEMBL346339,1 1,2 1,3 1,5 1,6 1,8 1,9 1,10 1,11 1,13 1,15 1,18 1,20 1,24 1,30 1,52 5}
{0 CHEMBL346503,1 1,2 1,3 1,5 1,6 1,9 1,10 1,11 1,13 1,18 1,20 1,22 1,24 1,30 1,52 4.921}
{0 CHEMBL346524,1 1,2 1,3 1,5 1,6 1,8 1,9 1,10 1,11 1,13 1,18 1,20 1,24 1,30 1,52 4.342}
{0 CHEMBL346968,1 1,2 1,3 1,5 1,6 1,8 1,9 1,10 1,11 1,13 1,15 1,18 1,20 1,24 1,30 1,52 5.215}
{0 CHEMBL347374,1 1,2 1,3 1,5 1,9 1,10 1,11 1,13 1,18 1,20 1,24 1,30 1,52 5.921}
{0 CHEMBL347828,1 1,2 1,3 1,5 1,6 1,8 1,9 1,10 1,13 1,15 1,18 1,24 1,30 1,52 4.222}
{0 CHEMBL348542,1 1,2 1,3 1,5 1,6 1,8 1,9 1,10 1,11 1,13 1,18 1,20 1,24 1,30 1,52 4.538}
{0 CHEMBL348558,1 1,2 1,3 1,5 1,6 1,8 1,9 1,10 1,13 1,15 1,18 1,24 1,30 1,52 4.523}
{0 CHEMBL351775,1 1,2 1,3 1,5 1,6 1,8 1,9 1,10 1,11 1,13 1,18 1,20 1,24 1,30 1,52 4.854}
{0 CHEMBL370038,4 1,7 1,12 1,15 1,30 1,52 7.092}
{0 CHEMBL370941,4 1,7 1,12 1,15 1,30 1,52 5.535}
{0 CHEMBL372631,4 1,7 1,12 1,13 1,15 1,16 1,22 1,24 1,30 1,48 1,52 6.222}
{0 CHEMBL372643,4 1,7 1,12 1,15 1,26 1,30 1,52 5.264}
{0 CHEMBL372797,4 1,7 1,12 1,13 1,15 1,16 1,22 1,24 1,30 1,48 1,52 6.222}
{0 CHEMBL373428,4 1,7 1,12 1,15 1,22 1,24 1,30 1,48 1,52 8}
{0 CHEMBL373429,4 1,7 1,12 1,15 1,22 1,24 1,30 1,48 1,52 8.155}
{0 CHEMBL379442,4 1,7 1,12 1,15 1,16 1,22 1,24 1,30 1,48 1,52 6.544}
{0 CHEMBL38499,4 1,7 1,12 1,15 1,17 1,26 1,30 1,52 6.569}
{0 CHEMBL387549,1 1,2 1,3 1,6 1,8 1,9 1,10 1,11 1,18 1,20 1,30 1,52 4.523}
{0 CHEMBL388517,6 1,8 1,9 1,10 1,11 1,13 1,18 1,20 1,22 1,24 1,30 1,52 4.523}
{0 CHEMBL389228,1 1,2 1,3 1,5 1,6 1,7 1,8 1,9 1,10 1,11 1,15 1,18 1,20 1,30 1,52 5}
{0 CHEMBL402444,4 1,7 1,12 1,15 1,30 1,52 5}
{0 CHEMBL416685,9 1,10 1,15 1,26 1,30 1,31 1,52 6.638}
{0 CHEMBL422152,1 1,2 1,3 1,5 1,6 1,8 1,9 1,10 1,11 1,13 1,18 1,20 1,22 1,24 1,30 1,52 5.444}
{0 CHEMBL422505,1 1,2 1,3 1,5 1,6 1,8 1,9 1,10 1,13 1,15 1,18 1,24 1,30 1,52 4.678}
{0 CHEMBL422698,1 1,2 1,3 1,5 1,6 1,8 1,9 1,10 1,11 1,13 1,18 1,20 1,24 1,30 1,52 5.319}
{0 CHEMBL429540,9 1,10 1,15 1,26 1,30 1,52 6.495}
{0 CHEMBL429594,4 1,7 1,12 1,15 1,30 1,52 4.733}
{0 CHEMBL492469,4 1,7 1,12 1,15 1,30 1,52 8.42}
{0 CHEMBL492630,4 1,7 1,12 1,15 1,30 1,52 8.721}
{0 CHEMBL50041,4 1,7 1,12 1,15 1,16 1,17 1,26 1,30 1,52 7.095}
{0 CHEMBL51008,4 1,7 1,12 1,15 1,17 1,26 1,30 1,47 1,52 6.618}
{0 CHEMBL51054,4 1,7 1,12 1,15 1,17 1,26 1,30 1,52 6.328}
{0 CHEMBL51395,4 1,7 1,12 1,15 1,17 1,26 1,30 1,52 6.627}
{0 CHEMBL51660,4 1,7 1,12 1,15 1,17 1,26 1,30 1,52 5.208}
{0 CHEMBL52295,4 1,7 1,12 1,15 1,16 1,17 1,26 1,30 1,52 4.848}
{0 CHEMBL52514,4 1,7 1,12 1,15 1,16 1,17 1,26 1,30 1,52 5.658}
{0 CHEMBL52742,4 1,7 1,12 1,15 1,16 1,17 1,26 1,30 1,52 7.067}
{0 CHEMBL53194,4 1,7 1,12 1,15 1,16 1,17 1,23 1,26 1,28 1,29 1,30 1,52 4.536}
{0 CHEMBL53655,4 1,7 1,12 1,15 1,16 1,17 1,26 1,30 1,52 6}
{0 CHEMBL53702,4 1,7 1,12 1,15 1,16 1,17 1,22 1,26 1,30 1,52 5.218}
{0 CHEMBL53775,4 1,7 1,12 1,15 1,16 1,17 1,26 1,30 1,52 4.767}
{0 CHEMBL54073,4 1,7 1,12 1,15 1,16 1,17 1,26 1,30 1,52 6}
{0 CHEMBL54238,4 1,7 1,12 1,15 1,17 1,26 1,30 1,52 5.29}
{0 CHEMBL54291,4 1,7 1,12 1,15 1,17 1,26 1,30 1,52 5.441}
{0 CHEMBL575060,4 1,7 1,12 1,15 1,17 1,26 1,30 1,52 4.125}
{0 CHEMBL58027,4 1,7 1,12 1,14 1,15 1,17 1,19 1,22 1,25 1,26 1,30 1,52 6.573}
{0 CHEMBL58054,4 1,7 1,12 1,14 1,15 1,16 1,17 1,18 1,19 1,20 1,21 1,22 1,23 1,25 1,26 1,27 1,28 1,29 1,30 1,52 7.222}
{0 CHEMBL58095,4 1,7 1,12 1,14 1,15 1,16 1,17 1,19 1,21 1,22 1,23 1,25 1,26 1,27 1,28 1,29 1,30 1,52 7.357}
{0 CHEMBL58541,4 1,7 1,12 1,14 1,15 1,17 1,19 1,22 1,25 1,26 1,30 1,52 6.08}
{0 CHEMBL58590,4 1,7 1,12 1,14 1,15 1,16 1,17 1,18 1,19 1,20 1,21 1,22 1,23 1,25 1,26 1,27 1,28 1,29 1,30 1,52 8.097}
{0 CHEMBL58718,4 1,7 1,12 1,14 1,15 1,17 1,19 1,22 1,25 1,26 1,30 1,52 6.513}
{0 CHEMBL58808,4 1,7 1,12 1,14 1,15 1,16 1,17 1,19 1,21 1,22 1,23 1,25 1,26 1,27 1,28 1,29 1,30 1,52 6.804}
{0 CHEMBL59284,4 1,7 1,12 1,14 1,15 1,16 1,17 1,19 1,21 1,22 1,23 1,25 1,26 1,27 1,28 1,30 1,52 7.554}
{0 CHEMBL59286,4 1,7 1,12 1,14 1,15 1,16 1,17 1,19 1,22 1,25 1,26 1,27 1,30 1,52 5.994}
{0 CHEMBL59297,4 1,7 1,12 1,14 1,15 1,16 1,17 1,18 1,19 1,21 1,22 1,23 1,25 1,26 1,27 1,28 1,30 1,52 6.883}
{0 CHEMBL59299,4 1,7 1,12 1,14 1,15 1,16 1,17 1,19 1,21 1,22 1,23 1,25 1,26 1,27 1,28 1,29 1,30 1,52 6.547}
{0 CHEMBL59551,4 1,7 1,12 1,14 1,15 1,17 1,19 1,22 1,25 1,26 1,30 1,52 7.936}
{0 CHEMBL59792,4 1,7 1,12 1,14 1,15 1,17 1,19 1,22 1,25 1,26 1,30 1,52 6.472}
{0 CHEMBL59948,4 1,7 1,11 1,12 1,14 1,15 1,16 1,17 1,19 1,21 1,22 1,23 1,25 1,26 1,27 1,28 1,29 1,30 1,52 6.268}
{0 CHEMBL60114,4 1,7 1,12 1,14 1,15 1,16 1,17 1,18 1,19 1,21 1,22 1,23 1,25 1,26 1,27 1,28 1,29 1,30 1,52 6.595}
{0 CHEMBL60168,4 1,7 1,12 1,14 1,15 1,16 1,17 1,19 1,21 1,22 1,23 1,25 1,26 1,27 1,28 1,29 1,30 1,52 7.229}
{0 CHEMBL60406,4 1,7 1,12 1,14 1,15 1,16 1,17 1,18 1,19 1,22 1,25 1,26 1,27 1,30 1,52 7.387}
{0 CHEMBL61307,4 1,7 1,12 1,14 1,15 1,16 1,17 1,19 1,22 1,25 1,26 1,27 1,30 1,52 6.239}
{0 CHEMBL61434,4 1,7 1,12 1,13 1,14 1,15 1,16 1,17 1,19 1,21 1,22 1,23 1,24 1,25 1,26 1,27 1,28 1,29 1,30 1,52 5.445}
{0 CHEMBL61697,4 1,7 1,12 1,14 1,15 1,17 1,19 1,22 1,25 1,26 1,28 1,29 1,30 1,52 6.174}
{0 CHEMBL61751,4 1,7 1,12 1,14 1,15 1,16 1,17 1,19 1,21 1,22 1,23 1,25 1,26 1,27 1,28 1,30 1,52 8.155}
{0 CHEMBL61997,4 1,7 1,12 1,14 1,15 1,17 1,19 1,22 1,25 1,26 1,30 1,52 6.91}
{0 CHEMBL62053,4 1,7 1,12 1,14 1,15 1,17 1,19 1,22 1,25 1,26 1,30 1,52 5.624}
{0 CHEMBL62055,4 1,7 1,12 1,14 1,15 1,16 1,17 1,19 1,22 1,25 1,26 1,27 1,30 1,52 5.886}
{0 CHEMBL62057,4 1,7 1,12 1,14 1,15 1,16 1,17 1,19 1,22 1,25 1,26 1,27 1,30 1,52 5.357}
{0 CHEMBL62086,4 1,7 1,12 1,14 1,15 1,17 1,19 1,22 1,25 1,26 1,30 1,52 7.539}
{0 CHEMBL63861,4 1,9 1,10 1,15 1,30 1,31 1,52 8.42}
{0 CHEMBL63927,9 1,10 1,15 1,26 1,30 1,31 1,52 6.367}
{0 CHEMBL67828,4 1,9 1,10 1,15 1,30 1,31 1,52 7.921}
{0 CHEMBL72366,4 1,7 1,12 1,15 1,18 1,30 1,52 5.167}
{0 CHEMBL73698,4 1,7 1,12 1,15 1,18 1,30 1,52 5.319}
{0 CHEMBL76232,4 1,7 1,12 1,15 1,17 1,26 1,30 1,52 4.392}
