{
  "data_set_description": {
    "collection_date": "November 2013",
    "creator": "Dr Jeremy Besnard, Dr Ivan Olier, Dr Noureddin Sadawi, Dr Larisa Soldatova, Dr Crina Grosan, Prof Ross King, Dr Richard Bickerton, Prof Andrew Hopkins and Dr Willem van Hoorn",
    "default_target_attribute": "pXC50",
    "description": "This dataset contains QSAR data (from ChEMBL version 17) showing activity values (unit is pseudo-pCI50) of several compounds on drug target ChEMBL_ID: CHEMBL5095 (TID: 101069), and it has 73 rows and 43 features (not including molecule IDs and class feature: molecule_id and pXC50). The features represent Basic Molecular Descriptors which were generated from SMILES strings.  Missing value imputation was applied to this dataset (By choosing the Median).",
    "description_version": "1",
    "file_id": "3602062",
    "format": "ARFF",
    "id": "36989",
    "licence": "Public",
    "md5_checksum": "1cc497e7c25e382093446ff0a2b23282",
    "minio_url": "https://data.openml.org/datasets/0003/36989/dataset_36989.pq",
    "name": "QSAR-DATASET-FOR-DRUG-TARGET-CHEMBL5095",
    "original_data_url": "https://www.ebi.ac.uk/chembl/target/inspect/CHEMBL5095",
    "parquet_url": "https://data.openml.org/datasets/0003/36989/dataset_36989.pq",
    "processing_date": "2018-10-04 05:11:24",
    "row_id_attribute": "molecule_id",
    "status": "deactivated",
    "tag": [
      "MetaQSAR",
      "study_13"
    ],
    "upload_date": "2016-07-15T23:06:56",
    "url": "https://api.openml.org/data/v1/download/3602062/QSAR-DATASET-FOR-DRUG-TARGET-CHEMBL5095.arff",
    "version": "10",
    "visibility": "public"
  }
}