{
  "data_set_description": {
    "collection_date": "November 2013",
    "creator": "Dr Jeremy Besnard, Dr Ivan Olier, Dr Noureddin Sadawi, Dr Larisa Soldatova, Dr Crina Grosan, Prof Ross King, Dr Richard Bickerton, Prof Andrew Hopkins and Dr Willem van Hoorn",
    "default_target_attribute": "pXC50",
    "description": "This dataset contains QSAR data (from ChEMBL version 17) showing activity values (unit is pseudo-pCI50) of several compounds on drug target ChEMBL_ID: CHEMBL1978 (TID: 65), and it has 1515 rows and 1361 features (not including molecule IDs and class feature: molecule_id and pXC50). The features represent Molecular Descriptors which were generated from SMILES strings. Missing value imputation was applied to this dataset (By choosing the Median).",
    "description_version": "1",
    "file_id": "3601946",
    "format": "ARFF",
    "id": "36987",
    "licence": "Public",
    "md5_checksum": "5df1e3fecb77f6c90d8d8dbb1350850e",
    "minio_url": "https://data.openml.org/datasets/0003/36987/dataset_36987.pq",
    "name": "QSAR-DATASET-FOR-DRUG-TARGET-CHEMBL1978",
    "original_data_url": "https://www.ebi.ac.uk/chembl/target/inspect/CHEMBL1978",
    "parquet_url": "https://data.openml.org/datasets/0003/36987/dataset_36987.pq",
    "processing_date": "2018-10-04 05:13:42",
    "row_id_attribute": "molecule_id",
    "status": "deactivated",
    "tag": [
      "MetaQSAR",
      "study_13"
    ],
    "upload_date": "2016-07-15T23:06:26",
    "url": "https://api.openml.org/data/v1/download/3601946/QSAR-DATASET-FOR-DRUG-TARGET-CHEMBL1978.arff",
    "version": "9",
    "visibility": "public"
  }
}