"molecule_id","AMW","C.","H.","Me","Mi","Mp","Mv","MW","N.","nAB","nAT","nB","nBM","nBO","nBR","nBT","nC","nCL","nCsp","nCsp2","nCsp3","nDB","nF","nH","nHet","nHM","nI","nN","nO","nP","nS","nSK","nTB","nX","O.","RBF","RBN","SCBO","Se","Si","Sp","Sv","X.","pXC50"
{1 7.154,2 34.2,3 48.7,4 1.012,5 1.144,6 0.621,7 0.597,8 543.7,9 9.2,10 6,11 76,13 13,14 40,16 77,17 26,20 14,21 12,22 7,24 37,25 13,28 7,29 6,32 39,35 7.9,36 0.156,37 12,38 50,39 76.93,40 86.973,41 47.188,42 45.341,44 6.398}
{0 CHEMBL568037,1 7.488,2 33.8,3 46.5,4 1.021,5 1.146,6 0.621,7 0.606,8 531.64,9 9.9,10 6,11 71,13 13,14 39,16 72,17 24,20 14,21 10,22 7,24 33,25 14,28 7,29 7,32 38,35 9.9,36 0.167,37 12,38 49,39 72.491,40 81.352,41 44.12,42 43.002,44 7.886}
{0 CHEMBL572824,1 7.346,2 40.8,3 45.9,4 1.005,5 1.129,6 0.655,7 0.627,8 719.92,9 7.1,10 22,11 98,13 29,14 57,16 102,17 40,20 28,21 12,22 7,24 45,25 13,28 7,29 6,32 53,35 6.1,36 0.127,37 13,38 75,39 98.465,40 110.633,41 64.233,42 61.448,44 8.097}
{0 CHEMBL573161,1 7.343,2 35.8,3 46.9,4 1.013,5 1.142,6 0.632,7 0.609,8 594.75,9 9.9,10 11,11 81,13 18,14 45,16 83,17 29,20 18,21 11,22 7,24 38,25 14,28 8,29 6,32 43,35 7.4,36 0.133,37 11,38 57.5,39 82.032,40 92.471,41 51.194,42 49.362,44 8.42}
{0 CHEMBL573213,1 7.303,2 36.5,3 47.1,4 1.011,5 1.14,6 0.635,7 0.61,8 620.79,9 9.4,10 12,11 85,13 19,14 47,16 87,17 31,20 20,21 11,22 7,24 40,25 14,28 8,29 6,32 45,35 7.1,36 0.149,37 13,38 60,39 85.916,40 96.886,41 53.955,42 51.889,44 7.509}
{0 CHEMBL573249,1 7.515,2 39.6,3 45.1,4 1.011,5 1.132,6 0.65,7 0.628,8 683.84,9 7.7,10 17,11 91,13 25,14 53,16 94,17 36,20 25,21 11,22 8,24 41,25 14,28 7,29 7,32 50,35 7.7,36 0.128,37 12,38 69.5,39 92.025,40 103.012,41 59.165,42 57.109,44 8.62}
{0 CHEMBL573368,1 7.72,2 41,3 43.4,4 1.014,5 1.129,6 0.658,7 0.639,8 640.76,9 7.2,10 18,11 83,13 25,14 50,16 86,17 34,20 26,21 8,22 7,24 36,25 13,28 6,29 7,32 47,35 8.4,36 0.151,37 13,38 66,39 84.156,40 93.684,41 54.637,42 53.034,44 6.301}
{0 CHEMBL573433,1 7.432,2 40.2,3 45.4,4 1.007,5 1.131,6 0.654,7 0.628,8 720.91,9 8.2,10 22,11 97,13 29,14 57,16 101,17 39,20 28,21 11,22 7,24 44,25 14,28 8,29 6,32 53,35 6.2,36 0.129,37 13,38 75,39 97.683,40 109.716,41 63.478,42 60.942,44 8.585}
{0 CHEMBL573434,1 7.207,2 37.2,3 47.7,4 1.008,5 1.137,6 0.636,7 0.609,8 619.8,9 8.1,10 12,11 86,13 19,14 47,16 88,17 32,20 20,21 12,22 7,24 41,25 13,28 7,29 6,32 45,35 7,36 0.148,37 13,38 60,39 86.698,40 97.803,41 54.711,42 52.394,44 7.77}
{0 CHEMBL573435,1 7.346,2 33.7,3 47.7,4 1.02,5 1.145,6 0.617,7 0.599,8 631.77,9 8.1,10 6,11 86,13 14,14 46,16 87,17 29,20 15,21 14,22 8,24 41,25 16,28 7,29 9,32 45,35 10.5,36 0.161,37 14,38 57,39 87.68,40 98.431,41 53.074,42 51.539,44 8.125}
{0 CHEMBL573436,1 7.238,2 35.4,3 47.9,4 1.013,5 1.141,6 0.627,7 0.603,8 694.88,9 8.3,10 11,11 96,13 19,14 52,16 98,17 34,20 19,21 15,22 8,24 46,25 16,28 8,29 8,32 50,35 8.3,36 0.133,37 13,38 65.5,39 97.221,40 109.55,41 60.148,42 57.899,44 7.699}
{0 CHEMBL573437,1 7.546,2 33.8,3 46.3,4 1.024,5 1.145,6 0.619,7 0.606,8 603.71,9 8.8,10 6,11 80,13 14,14 44,16 81,17 27,20 15,21 12,22 8,24 37,25 16,28 7,29 9,32 43,35 11.3,36 0.173,37 14,38 55,39 81.912,40 91.601,41 49.551,42 48.485,44 9.854}
{0 CHEMBL573438,1 7.509,2 39.3,3 45.2,4 1.012,5 1.132,6 0.648,7 0.626,8 630.77,9 7.1,10 17,11 84,13 24,14 48,16 86,17 33,20 24,21 9,22 7,24 38,25 13,28 6,29 7,32 46,35 8.3,36 0.174,37 15,38 63.5,39 85.04,40 95.099,41 54.398,42 52.561,44 6.456}
{0 CHEMBL573439,1 7.956,2 39.5,3 42.1,4 1.023,5 1.132,6 0.652,7 0.641,8 604.68,9 7.9,10 17,11 76,13 24,14 46,16 78,17 30,20 24,21 6,22 7,24 32,25 14,28 6,29 8,32 44,35 10.5,36 0.192,37 15,38 61.5,39 77.716,40 86.063,41 49.568,42 48.695,44 5.745}
{0 CHEMBL573440,1 7.72,2 41,3 43.4,4 1.014,5 1.129,6 0.658,7 0.639,8 640.76,9 7.2,10 18,11 83,13 25,14 50,16 86,17 34,20 26,21 8,22 7,24 36,25 13,28 6,29 7,32 47,35 8.4,36 0.151,37 13,38 66,39 84.156,40 93.684,41 54.637,42 53.034,44 6.301}
{0 CHEMBL573507,1 7.423,2 34.3,3 47.1,4 1.021,5 1.143,6 0.619,7 0.603,8 519.62,9 7.1,10 6,11 70,13 13,14 37,16 70,17 24,20 14,21 10,22 7,24 33,25 13,28 5,29 8,32 37,35 11.4,36 0.214,37 15,38 47,39 71.498,40 79.98,41 43.324,42 42.201,44 7.187}
{0 CHEMBL573529,1 7.377,2 34.2,3 47.4,4 1.02,5 1.143,6 0.62,7 0.602,8 560.68,9 7.9,10 6,11 76,13 13,14 41,16 77,17 26,20 14,21 12,22 7,24 36,25 14,28 6,29 8,32 40,35 10.5,36 0.182,37 14,38 51,39 77.483,40 86.893,41 47.091,42 45.749,44 5.699}
{0 CHEMBL573567,1 7.558,2 37.8,3 45.1,4 1.015,5 1.136,6 0.642,7 0.623,8 619.75,9 8.5,10 12,11 82,13 19,14 48,16 85,17 31,20 20,21 11,22 7,24 37,25 14,28 7,29 7,32 45,35 8.5,36 0.118,37 10,38 61,39 83.258,40 93.182,41 52.642,42 51.055,44 6.097}
{0 CHEMBL573669,1 7.308,2 36.8,3 47.1,4 1.012,5 1.138,6 0.634,7 0.61,8 635.8,9 8,10 12,11 87,13 18,14 49,16 90,17 32,20 18,21 14,22 6,24 41,25 14,28 7,29 7,32 46,35 8,36 0.144,37 13,38 61,39 88.025,40 99.012,41 55.165,42 53.109,44 7.921}
{0 CHEMBL573670,1 7.447,2 36.3,3 46.3,4 1.016,5 1.14,6 0.633,7 0.613,8 595.73,9 8.8,10 11,11 80,13 17,14 46,16 83,17 29,20 16,21 13,22 6,24 37,25 14,28 7,29 7,32 43,35 8.8,36 0.133,37 11,38 57.5,39 81.258,40 91.182,41 50.642,42 49.055,44 8.071}
{0 CHEMBL573671,1 7.296,2 35.6,3 47.5,4 1.014,5 1.14,6 0.627,7 0.605,8 736.92,9 7.9,10 12,11 101,13 19,14 56,16 104,17 36,20 19,21 17,22 7,24 48,25 17,28 8,29 9,32 53,35 8.9,36 0.144,37 15,38 69,39 102.432,40 115.175,41 63.364,42 61.14,44 6.569}
{0 CHEMBL573672,1 7.52,2 40.6,3 44.8,4 1.009,5 1.129,6 0.655,7 0.632,8 721.89,9 7.3,10 22,11 96,13 29,14 57,16 100,17 39,20 28,21 11,22 7,24 43,25 14,28 7,29 7,32 53,35 7.3,36 0.13,37 13,38 75,39 96.909,40 108.428,41 62.927,42 60.636,44 8.481}
{0 CHEMBL573673,1 7.558,2 37.8,3 45.1,4 1.015,5 1.136,6 0.642,7 0.623,8 619.75,9 8.5,10 12,11 82,13 19,14 48,16 85,17 31,20 20,21 11,22 7,24 37,25 14,28 7,29 7,32 45,35 8.5,36 0.118,37 10,38 61,39 83.258,40 93.182,41 52.642,42 51.055,44 6.071}
{0 CHEMBL573758,1 7.342,2 30.3,3 48.5,4 1.026,5 1.152,6 0.6,7 0.586,8 484.58,9 9.1,11 66,13 6,14 35,16 67,17 20,20 6,21 14,22 6,24 32,25 14,28 6,29 8,32 34,35 12.1,36 0.164,37 11,38 41,39 67.716,40 76.063,41 39.568,42 38.695,44 7.523}
{0 CHEMBL573772,1 7.486,2 35.4,3 46.2,4 1.018,5 1.142,6 0.629,7 0.611,8 486.59,9 9.2,10 6,11 65,13 12,14 37,16 67,17 23,20 13,21 10,22 6,24 30,25 12,28 6,29 6,32 35,35 9.2,36 0.104,37 7,38 46,39 66.178,40 74.229,41 40.898,42 39.739,44 6.222}
{0 CHEMBL573776,1 7.209,2 30.8,3 49.2,4 1.021,5 1.152,6 0.602,7 0.584,8 468.58,9 9.2,11 65,13 7,14 33,16 65,17 20,20 8,21 12,22 7,24 32,25 13,28 6,29 7,32 33,35 10.8,36 0.169,37 11,38 40,39 66.389,40 74.853,41 39.114,42 37.98,44 7.824}
{0 CHEMBL574306,1 7.209,2 36,3 48,4 1.011,5 1.14,6 0.629,7 0.604,8 720.92,9 8,10 12,11 100,13 20,14 54,16 102,17 36,20 21,21 15,22 8,24 48,25 16,28 8,29 8,32 52,35 8,36 0.147,37 15,38 68,39 101.105,40 113.966,41 62.91,42 60.426,44 7.523}
{0 CHEMBL574642,1 7.334,2 30.2,3 48.8,4 1.028,5 1.151,6 0.595,7 0.584,8 315.37,9 7,11 43,13 5,14 21,16 42,17 13,20 6,21 7,22 5,24 21,25 9,28 3,29 6,32 22,35 14,36 0.214,37 9,38 26,39 44.222,40 49.488,41 25.597,42 25.094,44 6.125}
{0 CHEMBL574673,1 7.211,2 30.4,3 49.4,4 1.023,5 1.152,6 0.599,7 0.582,8 569.7,9 8.9,11 79,13 8,14 40,16 79,17 24,20 9,21 15,22 8,24 39,25 16,28 7,29 9,32 40,35 11.4,36 0.165,37 13,38 48,39 80.796,40 91.016,41 47.313,42 46.012,44 8.071}
{0 CHEMBL576557,1 7.31,2 34.2,3 47.9,4 1.019,5 1.142,6 0.618,7 0.599,8 533.65,9 6.8,10 6,11 73,13 13,14 38,16 73,17 25,20 14,21 11,22 7,24 35,25 13,28 5,29 8,32 38,35 11,36 0.219,37 16,38 48,39 74.381,40 83.395,41 45.085,42 43.727,44 9.284}
{0 CHEMBL576970,1 7.436,2 34.7,3 46.7,4 1.018,5 1.144,6 0.625,7 0.607,8 557.68,9 9.3,10 6,11 75,13 13,14 42,16 77,17 26,20 14,21 12,22 7,24 35,25 14,28 7,29 7,32 40,35 9.3,36 0.117,37 9,38 52,39 76.374,40 85.767,41 46.881,42 45.529,44 7.187}
{0 CHEMBL577178,1 7.233,2 35.8,3 47.8,4 1.011,5 1.141,6 0.63,7 0.605,8 484.62,9 9,10 6,11 67,13 12,14 37,16 69,17 24,20 13,21 11,22 6,24 32,25 11,28 6,29 5,32 35,35 7.5,36 0.101,37 7,38 46,39 67.734,40 76.434,41 42.205,42 40.551,44 6.824}
{0 CHEMBL577371,1 7.337,2 29.7,3 48.4,4 1.025,5 1.155,6 0.599,7 0.586,8 469.57,9 10.9,11 64,13 7,14 33,16 64,17 19,20 8,21 11,22 7,24 31,25 14,28 7,29 7,32 33,35 10.9,36 0.172,37 11,38 40,39 65.607,40 73.936,41 38.358,42 37.475,44 8.071}
{0 CHEMBL577594,1 7.469,2 30.2,3 47.6,4 1.029,5 1.153,6 0.6,7 0.59,8 470.55,9 9.5,11 63,13 7,14 33,16 63,17 19,20 8,21 11,22 7,24 30,25 14,28 6,29 8,32 33,35 12.7,36 0.175,37 11,38 40,39 64.832,40 72.647,41 37.807,42 37.168,44 9.638}
{0 CHEMBL582897,1 7.514,2 38.1,3 45.4,4 1.014,5 1.135,6 0.643,7 0.622,8 728.89,9 8.2,10 17,11 97,13 25,14 56,16 100,17 37,20 25,21 12,22 8,24 44,25 16,28 8,29 8,32 53,35 8.2,36 0.14,37 14,38 72.5,39 98.338,40 110.135,41 62.387,42 60.372,44 9.456}
{0 CHEMBL582898,1 7.567,2 41.6,3 44.2,4 1.009,5 1.127,6 0.661,7 0.637,8 855.05,9 7.1,10 28,11 113,13 36,14 68,16 118,17 47,20 35,21 12,22 8,24 50,25 16,28 8,29 8,32 63,35 7.1,36 0.136,37 16,38 90,39 113.988,40 127.381,41 74.671,42 71.952,44 9.432}
{0 CHEMBL582899,1 7.399,2 37.8,3 46.3,4 1.013,5 1.135,6 0.639,7 0.617,8 606.75,9 7.3,10 12,11 82,13 19,14 46,16 84,17 31,20 20,21 11,22 7,24 38,25 13,28 6,29 7,32 44,35 8.5,36 0.155,37 13,38 59,39 83.04,40 93.099,41 52.398,42 50.561,44 7.886}
{0 CHEMBL582900,1 7.545,2 33.3,3 46.4,4 1.025,5 1.146,6 0.617,7 0.604,8 520.61,9 8.7,10 6,11 69,13 12,14 38,16 70,17 23,20 13,21 10,22 6,24 32,25 14,28 6,29 8,32 37,35 11.6,36 0.157,37 11,38 47,39 70.716,40 79.063,41 42.568,42 41.695,44 5.699}
{0 CHEMBL583115,1 7.331,2 39.3,3 46.4,4 1.008,5 1.132,6 0.647,7 0.62,8 821.04,9 7.1,10 22,11 112,13 30,14 64,16 116,17 44,20 29,21 15,22 8,24 52,25 16,28 8,29 8,32 60,35 7.1,36 0.129,37 15,38 83,39 112.872,40 126.796,41 72.432,42 69.479,44 8.301}
{0 CHEMBL584154,1 7.663,2 35.9,3 44.9,4 1.022,5 1.141,6 0.633,7 0.619,8 597.7,9 9,10 11,11 78,13 17,14 46,16 81,17 28,20 16,21 12,22 6,24 35,25 15,28 7,29 8,32 43,35 10.3,36 0.136,37 11,38 57.5,39 79.701,40 88.976,41 49.335,42 48.243,44 8.222}
{0 CHEMBL584155,1 7.503,2 36.5,3 45.9,4 1.017,5 1.139,6 0.634,7 0.615,8 637.77,9 8.2,10 12,11 85,13 18,14 49,16 88,17 31,20 18,21 13,22 6,24 39,25 15,28 7,29 8,32 46,35 9.4,36 0.148,37 13,38 61,39 86.469,40 96.807,41 53.858,42 52.297,44 8.77}
{0 CHEMBL584157,1 7.405,2 36,3 46.5,4 1.014,5 1.141,6 0.633,7 0.612,8 636.79,9 9.3,10 12,11 86,13 18,14 49,16 89,17 31,20 18,21 13,22 6,24 40,25 15,28 8,29 7,32 46,35 8.1,36 0.146,37 13,38 61,39 87.243,40 98.095,41 54.409,42 52.604,44 7.959}
