"molecule_id","FCFP4_1024b541","FCFP4_1024b75","FCFP4_1024b6","FCFP4_1024b870","FCFP4_1024b422","FCFP4_1024b72","FCFP4_1024b208","FCFP4_1024b661","FCFP4_1024b289","FCFP4_1024b492","FCFP4_1024b823","FCFP4_1024b17","FCFP4_1024b170","FCFP4_1024b48","FCFP4_1024b565","FCFP4_1024b557","FCFP4_1024b110","FCFP4_1024b25","FCFP4_1024b408","FCFP4_1024b540","FCFP4_1024b564","FCFP4_1024b607","FCFP4_1024b839","FCFP4_1024b369","FCFP4_1024b702","FCFP4_1024b680","FCFP4_1024b71","FCFP4_1024b769","FCFP4_1024b714","FCFP4_1024b600","FCFP4_1024b774","FCFP4_1024b804","FCFP4_1024b18","FCFP4_1024b429","FCFP4_1024b765","FCFP4_1024b365","FCFP4_1024b603","FCFP4_1024b46","FCFP4_1024b434","FCFP4_1024b257","FCFP4_1024b329","FCFP4_1024b908","FCFP4_1024b9","FCFP4_1024b178","FCFP4_1024b379","FCFP4_1024b403","FCFP4_1024b412","FCFP4_1024b1006","FCFP4_1024b524","FCFP4_1024b461","FCFP4_1024b903","FCFP4_1024b695","FCFP4_1024b122","FCFP4_1024b615","FCFP4_1024b107","FCFP4_1024b54","FCFP4_1024b942","FCFP4_1024b483","FCFP4_1024b671","FCFP4_1024b260","FCFP4_1024b158","FCFP4_1024b191","FCFP4_1024b325","FCFP4_1024b163","FCFP4_1024b237","FCFP4_1024b626","FCFP4_1024b140","FCFP4_1024b844","FCFP4_1024b589","FCFP4_1024b138","FCFP4_1024b1018","FCFP4_1024b574","FCFP4_1024b246","FCFP4_1024b733","FCFP4_1024b881","FCFP4_1024b873","FCFP4_1024b862","FCFP4_1024b678","FCFP4_1024b847","FCFP4_1024b800","FCFP4_1024b599","FCFP4_1024b650","FCFP4_1024b453","FCFP4_1024b669","FCFP4_1024b269","FCFP4_1024b525","FCFP4_1024b948","FCFP4_1024b490","FCFP4_1024b280","FCFP4_1024b986","FCFP4_1024b983","FCFP4_1024b69","FCFP4_1024b226","FCFP4_1024b820","FCFP4_1024b123","FCFP4_1024b746","FCFP4_1024b643","FCFP4_1024b87","FCFP4_1024b859","FCFP4_1024b922","FCFP4_1024b641","FCFP4_1024b20","pXC50"
{10 1,11 1,12 1,13 1,14 1,15 1,16 1,17 1,18 1,19 1,20 1,21 1,22 1,23 1,24 1,25 1,29 1,31 1,32 1,33 1,34 1,35 1,36 1,39 1,42 1,46 1,47 1,49 1,50 1,58 1,60 1,61 1,62 1,70 1,72 1,79 1,81 1,82 1,84 1,90 1,103 5.481}
{0 CHEMBL1086741,12 1,13 1,18 1,29 1,34 1,37 1,42 1,48 1,52 1,55 1,56 1,64 1,65 1,66 1,68 1,69 1,72 1,77 1,78 1,79 1,84 1,87 1,89 1,90 1,99 1,103 4.886}
{0 CHEMBL1086742,10 1,12 1,13 1,18 1,29 1,34 1,42 1,48 1,52 1,55 1,56 1,64 1,65 1,66 1,68 1,69 1,72 1,77 1,78 1,79 1,84 1,87 1,89 1,90 1,99 1,103 4.553}
{0 CHEMBL1086743,7 1,12 1,13 1,18 1,29 1,34 1,37 1,42 1,48 1,52 1,55 1,56 1,64 1,65 1,66 1,68 1,69 1,72 1,77 1,78 1,79 1,84 1,87 1,89 1,90 1,99 1,103 4.523}
{0 CHEMBL1086744,12 1,13 1,18 1,20 1,29 1,34 1,42 1,48 1,52 1,55 1,56 1,64 1,65 1,66 1,68 1,69 1,72 1,77 1,78 1,79 1,83 1,84 1,87 1,89 1,90 1,103 4.669}
{0 CHEMBL1087253,12 1,13 1,18 1,29 1,34 1,42 1,48 1,52 1,55 1,56 1,64 1,65 1,66 1,68 1,69 1,72 1,77 1,78 1,79 1,84 1,87 1,89 1,90 1,103 4.523}
{0 CHEMBL1087897,10 1,12 1,13 1,18 1,29 1,34 1,42 1,48 1,52 1,55 1,56 1,64 1,65 1,66 1,68 1,69 1,72 1,77 1,78 1,79 1,84 1,87 1,89 1,90 1,103 4.523}
{0 CHEMBL1163778,10 1,11 1,14 1,15 1,16 1,17 1,19 1,20 1,21 1,22 1,23 1,24 1,29 1,33 1,34 1,39 1,47 1,58 1,60 1,61 1,72 1,79 1,103 6.606}
{0 CHEMBL1164212,7 1,10 1,11 1,14 1,15 1,16 1,17 1,19 1,20 1,21 1,22 1,23 1,24 1,29 1,33 1,34 1,37 1,38 1,39 1,43 1,47 1,53 1,58 1,61 1,72 1,79 1,84 1,99 1,103 7.444}
{0 CHEMBL1164225,10 1,11 1,14 1,15 1,16 1,17 1,19 1,20 1,21 1,22 1,23 1,24 1,29 1,33 1,34 1,37 1,39 1,43 1,47 1,53 1,58 1,61 1,72 1,79 1,99 1,103 6.672}
{0 CHEMBL1164226,10 1,11 1,14 1,15 1,16 1,17 1,19 1,20 1,21 1,22 1,23 1,24 1,29 1,33 1,34 1,37 1,39 1,43 1,47 1,53 1,58 1,61 1,72 1,79 1,99 1,103 6.493}
{0 CHEMBL1164227,10 1,11 1,14 1,15 1,16 1,17 1,19 1,20 1,21 1,22 1,23 1,24 1,29 1,33 1,34 1,37 1,39 1,43 1,47 1,53 1,58 1,61 1,72 1,79 1,99 1,103 7.854}
{0 CHEMBL1164241,10 1,11 1,14 1,15 1,16 1,17 1,19 1,20 1,21 1,22 1,23 1,24 1,29 1,33 1,34 1,37 1,39 1,43 1,47 1,53 1,58 1,61 1,72 1,79 1,99 1,103 6.553}
{0 CHEMBL1164243,10 1,11 1,14 1,15 1,16 1,17 1,19 1,20 1,21 1,22 1,23 1,24 1,29 1,33 1,34 1,37 1,39 1,43 1,47 1,53 1,58 1,61 1,72 1,79 1,99 1,103 6.708}
{0 CHEMBL116438,12 1,13 1,16 1,18 1,32 1,34 1,57 1,89 1,103 4.699}
{0 CHEMBL1164992,10 1,11 1,14 1,15 1,16 1,17 1,19 1,20 1,21 1,22 1,23 1,24 1,29 1,33 1,34 1,36 1,47 1,58 1,61 1,72 1,79 1,103 7.06}
{0 CHEMBL1165082,10 1,11 1,14 1,15 1,16 1,17 1,19 1,20 1,21 1,22 1,23 1,24 1,29 1,33 1,34 1,37 1,39 1,43 1,47 1,53 1,58 1,61 1,72 1,79 1,99 1,100 1,103 7.538}
{0 CHEMBL1165164,10 1,11 1,12 1,13 1,14 1,15 1,16 1,17 1,18 1,19 1,20 1,21 1,22 1,23 1,24 1,29 1,32 1,33 1,34 1,37 1,39 1,43 1,47 1,50 1,53 1,58 1,61 1,72 1,79 1,99 1,103 7.824}
{0 CHEMBL1165292,10 1,11 1,12 1,13 1,14 1,15 1,16 1,17 1,19 1,20 1,21 1,22 1,23 1,24 1,29 1,33 1,34 1,39 1,47 1,50 1,55 1,56 1,58 1,60 1,61 1,72 1,79 1,83 1,103 6.281}
{0 CHEMBL1165293,10 1,11 1,12 1,13 1,14 1,15 1,16 1,17 1,19 1,20 1,21 1,22 1,23 1,24 1,29 1,33 1,34 1,39 1,47 1,50 1,55 1,56 1,58 1,60 1,61 1,72 1,79 1,83 1,103 6.67}
{0 CHEMBL1200666,10 1,11 1,14 1,15 1,16 1,17 1,19 1,20 1,21 1,22 1,23 1,24 1,25 1,29 1,31 1,33 1,34 1,35 1,36 1,47 1,58 1,61 1,62 1,72 1,79 1,103 9.509}
{0 CHEMBL1209109,12 1,13 1,18 1,25 1,32 1,33 1,34 1,36 1,47 1,50 1,57 1,79 1,103 5}
{0 CHEMBL1209170,12 1,13 1,18 1,25 1,32 1,33 1,34 1,36 1,47 1,50 1,57 1,72 1,103 5}
{0 CHEMBL1209173,12 1,13 1,18 1,25 1,32 1,33 1,34 1,36 1,47 1,50 1,57 1,72 1,103 5}
{0 CHEMBL1269462,10 1,12 1,13 1,18 1,23 1,29 1,32 1,33 1,34 1,36 1,47 1,50 1,72 1,79 1,84 1,99 1,103 4.523}
{0 CHEMBL1269463,7 1,10 1,12 1,13 1,18 1,29 1,32 1,34 1,36 1,47 1,50 1,57 1,72 1,79 1,84 1,91 1,99 1,103 4.523}
{0 CHEMBL1269464,10 1,12 1,13 1,18 1,23 1,29 1,32 1,33 1,34 1,36 1,47 1,50 1,72 1,79 1,84 1,99 1,103 4.523}
{0 CHEMBL1269465,10 1,12 1,13 1,18 1,29 1,32 1,34 1,36 1,47 1,50 1,57 1,72 1,79 1,84 1,91 1,99 1,103 4.523}
{0 CHEMBL1269466,10 1,12 1,13 1,18 1,29 1,32 1,34 1,42 1,49 1,50 1,72 1,79 1,84 1,99 1,103 4.523}
{0 CHEMBL1270254,10 1,12 1,13 1,18 1,29 1,32 1,34 1,47 1,72 1,79 1,84 1,99 1,103 7.046}
{0 CHEMBL1270546,7 1,10 1,12 1,13 1,18 1,29 1,32 1,34 1,36 1,47 1,50 1,72 1,79 1,84 1,99 1,103 4.678}
{0 CHEMBL1270644,10 1,12 1,13 1,18 1,29 1,32 1,34 1,36 1,47 1,50 1,72 1,79 1,84 1,99 1,103 4.638}
{0 CHEMBL1270746,10 1,12 1,13 1,18 1,23 1,29 1,32 1,34 1,36 1,47 1,50 1,72 1,79 1,84 1,99 1,103 4.523}
{0 CHEMBL1270848,10 1,12 1,13 1,18 1,29 1,32 1,34 1,47 1,72 1,79 1,84 1,99 1,103 4.523}
{0 CHEMBL1270948,10 1,12 1,13 1,18 1,29 1,32 1,34 1,36 1,47 1,50 1,72 1,79 1,84 1,99 1,103 4.959}
{0 CHEMBL1271042,10 1,11 1,12 1,13 1,14 1,15 1,16 1,17 1,19 1,20 1,21 1,22 1,23 1,24 1,29 1,33 1,34 1,36 1,47 1,50 1,55 1,56 1,58 1,61 1,72 1,79 1,83 1,103 6.971}
{0 CHEMBL1271050,10 1,12 1,13 1,18 1,29 1,32 1,34 1,36 1,47 1,50 1,72 1,79 1,84 1,99 1,103 5.149}
{0 CHEMBL1271154,10 1,12 1,13 1,18 1,23 1,29 1,32 1,34 1,36 1,47 1,50 1,72 1,79 1,84 1,99 1,103 5.444}
{0 CHEMBL1271259,10 1,12 1,13 1,18 1,29 1,32 1,34 1,47 1,72 1,79 1,84 1,99 1,103 4.658}
{0 CHEMBL1271360,10 1,12 1,13 1,18 1,29 1,32 1,34 1,49 1,50 1,72 1,79 1,84 1,97 1,99 1,103 4.523}
{0 CHEMBL1327417,12 1,13 1,18 1,20 1,32 1,34 1,50 1,57 1,68 1,83 1,88 1,89 1,103 4.425}
{0 CHEMBL142827,12 1,13 1,18 1,20 1,32 1,50 1,68 1,83 1,88 1,103 4.666}
{0 CHEMBL1494735,12 1,13 1,18 1,32 1,33 1,63 1,68 1,72 1,103 5.699}
{0 CHEMBL1528294,12 1,13 1,18 1,20 1,32 1,36 1,50 1,68 1,79 1,83 1,88 1,103 4.977}
{0 CHEMBL1626334,9 1,12 1,13 1,16 1,18 1,32 1,43 1,57 1,79 1,88 1,92 1,98 1,103 4.86}
{0 CHEMBL1834889,10 1,12 1,13 1,18 1,29 1,32 1,34 1,44 1,47 1,49 1,72 1,76 1,79 1,84 1,99 1,103 7.712}
{0 CHEMBL1834890,10 1,12 1,13 1,18 1,20 1,29 1,32 1,34 1,47 1,72 1,79 1,84 1,99 1,103 8.955}
{0 CHEMBL1834891,5 1,10 1,12 1,13 1,18 1,29 1,32 1,34 1,47 1,49 1,72 1,79 1,84 1,99 1,103 9.036}
{0 CHEMBL1834892,5 1,10 1,12 1,13 1,18 1,29 1,32 1,34 1,47 1,49 1,72 1,79 1,84 1,99 1,103 8.903}
{0 CHEMBL1834893,10 1,12 1,13 1,18 1,29 1,32 1,34 1,44 1,47 1,49 1,72 1,79 1,84 1,99 1,103 10.222}
{0 CHEMBL1834894,10 1,12 1,13 1,18 1,29 1,32 1,34 1,44 1,47 1,49 1,72 1,79 1,84 1,99 1,103 8.889}
{0 CHEMBL197589,10 1,12 1,13 1,18 1,29 1,32 1,34 1,47 1,72 1,79 1,84 1,99 1,103 7.398}
{0 CHEMBL197946,12 1,13 1,18 1,32 1,34 1,47 1,72 1,79 1,84 1,103 7.398}
{0 CHEMBL202613,10 1,11 1,14 1,15 1,16 1,17 1,19 1,20 1,21 1,22 1,23 1,24 1,29 1,33 1,34 1,36 1,47 1,58 1,61 1,72 1,79 1,89 1,103 6.398}
{0 CHEMBL203485,10 1,11 1,12 1,13 1,14 1,15 1,16 1,17 1,18 1,19 1,20 1,21 1,22 1,23 1,24 1,25 1,29 1,31 1,32 1,33 1,34 1,35 1,39 1,42 1,46 1,47 1,49 1,57 1,58 1,60 1,61 1,62 1,70 1,72 1,78 1,79 1,82 1,90 1,103 6.18}
{0 CHEMBL204045,10 1,11 1,12 1,13 1,14 1,15 1,16 1,17 1,18 1,19 1,20 1,21 1,22 1,23 1,24 1,25 1,29 1,31 1,32 1,33 1,34 1,35 1,36 1,39 1,42 1,46 1,47 1,49 1,50 1,58 1,60 1,61 1,62 1,70 1,72 1,79 1,81 1,82 1,84 1,90 1,103 5.699}
{0 CHEMBL205727,10 1,11 1,12 1,13 1,14 1,15 1,16 1,17 1,18 1,19 1,20 1,21 1,22 1,23 1,24 1,25 1,29 1,31 1,32 1,33 1,34 1,35 1,36 1,39 1,42 1,46 1,47 1,49 1,50 1,58 1,60 1,61 1,62 1,70 1,72 1,79 1,81 1,82 1,84 1,90 1,103 6.684}
{0 CHEMBL2058272,10 1,11 1,14 1,15 1,16 1,17 1,19 1,20 1,21 1,22 1,23 1,24 1,25 1,29 1,33 1,34 1,39 1,47 1,62 1,72 1,79 1,103 10.538}
{0 CHEMBL2058273,10 1,11 1,14 1,15 1,16 1,17 1,19 1,20 1,21 1,22 1,23 1,24 1,25 1,29 1,33 1,34 1,47 1,62 1,72 1,79 1,103 9.42}
{0 CHEMBL2058274,10 1,11 1,14 1,15 1,16 1,17 1,19 1,20 1,21 1,22 1,23 1,24 1,25 1,29 1,33 1,34 1,47 1,62 1,72 1,79 1,100 1,103 9.387}
{0 CHEMBL2069323,12 1,13 1,18 1,32 1,33 1,34 1,50 1,55 1,56 1,57 1,89 1,91 1,95 1,96 1,101 1,102 1,103 4.519}
{0 CHEMBL2070838,12 1,13 1,18 1,32 1,34 1,47 1,50 1,57 1,89 1,91 1,98 1,103 4.602}
{0 CHEMBL2070839,9 1,12 1,13 1,16 1,18 1,32 1,34 1,43 1,57 1,79 1,84 1,88 1,92 1,98 1,103 5.237}
{0 CHEMBL2070840,9 1,12 1,13 1,16 1,18 1,32 1,34 1,43 1,57 1,79 1,88 1,89 1,92 1,98 1,103 4.939}
{0 CHEMBL2070841,6 1,12 1,13 1,16 1,18 1,30 1,32 1,33 1,68 1,72 1,79 1,92 1,100 1,103 5.473}
{0 CHEMBL2070842,6 1,12 1,13 1,16 1,18 1,30 1,32 1,33 1,50 1,68 1,72 1,79 1,103 5.184}
{0 CHEMBL2070843,6 1,12 1,13 1,16 1,18 1,30 1,32 1,33 1,34 1,68 1,72 1,79 1,87 1,103 5.185}
{0 CHEMBL2070844,6 1,12 1,13 1,16 1,18 1,30 1,32 1,33 1,34 1,50 1,68 1,79 1,103 4.652}
{0 CHEMBL2070845,12 1,13 1,18 1,32 1,33 1,34 1,50 1,55 1,56 1,57 1,91 1,95 1,96 1,101 1,102 1,103 5.022}
{0 CHEMBL2070846,12 1,13 1,18 1,32 1,33 1,50 1,55 1,56 1,57 1,91 1,95 1,96 1,101 1,102 1,103 4.558}
{0 CHEMBL2070847,12 1,13 1,18 1,32 1,33 1,50 1,55 1,56 1,57 1,91 1,95 1,96 1,101 1,102 1,103 4.851}
{0 CHEMBL2070848,12 1,13 1,18 1,32 1,33 1,50 1,55 1,56 1,57 1,91 1,95 1,96 1,101 1,102 1,103 4.764}
{0 CHEMBL2070849,12 1,13 1,18 1,32 1,33 1,50 1,55 1,56 1,57 1,91 1,95 1,96 1,101 1,102 1,103 4.539}
{0 CHEMBL2070850,12 1,13 1,18 1,32 1,33 1,50 1,55 1,56 1,57 1,79 1,83 1,91 1,95 1,96 1,101 1,102 1,103 4.815}
{0 CHEMBL2070851,12 1,13 1,18 1,32 1,33 1,50 1,55 1,56 1,57 1,91 1,95 1,96 1,101 1,102 1,103 4.6}
{0 CHEMBL2070852,12 1,13 1,18 1,32 1,33 1,50 1,55 1,56 1,57 1,91 1,95 1,96 1,101 1,102 1,103 4.656}
{0 CHEMBL2070853,12 1,13 1,18 1,32 1,33 1,96 1,99 1,103 4.688}
{0 CHEMBL2070854,12 1,13 1,17 1,18 1,32 1,33 1,50 1,57 1,91 1,96 1,99 1,103 4.553}
{0 CHEMBL2070855,12 1,13 1,17 1,18 1,32 1,33 1,50 1,99 1,103 4.848}
{0 CHEMBL2070856,12 1,13 1,33 1,34 1,50 1,57 1,80 1,84 1,90 1,95 1,103 4.863}
{0 CHEMBL2070857,7 1,12 1,13 1,18 1,33 1,37 1,43 1,49 1,53 1,68 1,71 1,72 1,79 1,84 1,88 1,96 1,99 1,100 1,103 4.979}
{0 CHEMBL2070858,9 1,12 1,13 1,16 1,18 1,32 1,34 1,43 1,57 1,79 1,89 1,98 1,103 5.335}
{0 CHEMBL2070859,9 1,12 1,13 1,16 1,18 1,32 1,34 1,43 1,57 1,79 1,88 1,92 1,98 1,103 5.352}
{0 CHEMBL2070860,12 1,13 1,18 1,32 1,50 1,55 1,56 1,57 1,83 1,91 1,95 1,96 1,101 1,102 1,103 4.742}
{0 CHEMBL2070861,12 1,13 1,18 1,32 1,50 1,55 1,56 1,57 1,83 1,91 1,95 1,96 1,101 1,102 1,103 4.499}
{0 CHEMBL2070862,12 1,13 1,18 1,32 1,34 1,50 1,55 1,56 1,57 1,83 1,91 1,95 1,96 1,101 1,102 1,103 4.712}
{0 CHEMBL2070863,12 1,13 1,18 1,32 1,50 1,55 1,56 1,57 1,83 1,91 1,95 1,96 1,101 1,102 1,103 4.599}
{0 CHEMBL2070864,12 1,13 1,18 1,32 1,47 1,50 1,55 1,56 1,57 1,83 1,91 1,95 1,96 1,98 1,101 1,102 1,103 4.87}
{0 CHEMBL2070865,3 1,4 1,8 1,9 1,12 1,13 1,18 1,32 1,36 1,43 1,44 1,50 1,55 1,56 1,57 1,83 1,91 1,95 1,96 1,101 1,102 1,103 4.73}
{0 CHEMBL2070866,12 1,13 1,18 1,50 1,55 1,56 1,57 1,79 1,83 1,91 1,95 1,101 1,102 1,103 4.697}
{0 CHEMBL2070867,12 1,13 1,18 1,32 1,50 1,55 1,56 1,57 1,83 1,91 1,95 1,96 1,101 1,102 1,103 4.677}
{0 CHEMBL2070868,10 1,12 1,13 1,18 1,32 1,36 1,44 1,50 1,55 1,56 1,57 1,72 1,83 1,91 1,95 1,96 1,99 1,101 1,102 1,103 4.558}
{0 CHEMBL2070869,12 1,13 1,18 1,32 1,50 1,55 1,56 1,57 1,83 1,91 1,95 1,96 1,101 1,102 1,103 4.526}
{0 CHEMBL2070870,12 1,13 1,18 1,32 1,50 1,55 1,56 1,57 1,83 1,91 1,95 1,96 1,101 1,102 1,103 4.43}
{0 CHEMBL2070871,12 1,13 1,18 1,32 1,34 1,50 1,55 1,56 1,57 1,83 1,91 1,95 1,96 1,101 1,102 1,103 4.577}
{0 CHEMBL2070872,12 1,13 1,18 1,32 1,50 1,55 1,56 1,57 1,83 1,91 1,95 1,96 1,101 1,102 1,103 4.752}
{0 CHEMBL2070873,12 1,13 1,18 1,32 1,47 1,50 1,55 1,56 1,57 1,83 1,91 1,95 1,96 1,98 1,101 1,102 1,103 5.06}
{0 CHEMBL2070874,3 1,4 1,8 1,9 1,12 1,13 1,18 1,32 1,36 1,43 1,44 1,50 1,55 1,56 1,57 1,83 1,91 1,95 1,96 1,101 1,102 1,103 5.357}
{0 CHEMBL2070875,12 1,13 1,18 1,32 1,50 1,55 1,56 1,57 1,83 1,91 1,95 1,96 1,101 1,102 1,103 4.62}
{0 CHEMBL2070876,12 1,13 1,18 1,32 1,34 1,50 1,55 1,56 1,57 1,83 1,91 1,95 1,96 1,101 1,102 1,103 4.614}
{0 CHEMBL2070877,12 1,13 1,18 1,32 1,33 1,50 1,55 1,56 1,57 1,83 1,91 1,96 1,103 4.155}
{0 CHEMBL2070878,12 1,13 1,18 1,32 1,50 1,55 1,56 1,57 1,83 1,91 1,95 1,96 1,102 1,103 4.68}
{0 CHEMBL2070879,12 1,13 1,18 1,32 1,34 1,50 1,56 1,57 1,91 1,95 1,101 1,102 1,103 4.155}
{0 CHEMBL2112314,10 1,11 1,14 1,15 1,16 1,17 1,19 1,20 1,21 1,22 1,23 1,24 1,25 1,29 1,31 1,33 1,34 1,35 1,36 1,47 1,58 1,61 1,62 1,72 1,79 1,84 1,90 1,100 1,103 9.398}
{0 CHEMBL2112315,10 1,11 1,14 1,15 1,16 1,17 1,19 1,20 1,21 1,22 1,23 1,24 1,25 1,29 1,31 1,33 1,34 1,35 1,36 1,47 1,58 1,61 1,62 1,72 1,79 1,84 1,90 1,103 9.456}
{0 CHEMBL213868,10 1,11 1,14 1,15 1,16 1,17 1,19 1,20 1,21 1,22 1,23 1,24 1,25 1,29 1,31 1,33 1,34 1,35 1,39 1,40 1,46 1,47 1,49 1,58 1,61 1,62 1,72 1,79 1,90 1,103 8.222}
{0 CHEMBL213915,10 1,11 1,14 1,15 1,16 1,17 1,19 1,20 1,21 1,22 1,23 1,24 1,25 1,29 1,31 1,33 1,34 1,35 1,38 1,39 1,40 1,41 1,46 1,47 1,49 1,63 1,72 1,76 1,79 1,90 1,97 1,103 8.092}
{0 CHEMBL214134,10 1,11 1,14 1,15 1,16 1,17 1,19 1,20 1,21 1,22 1,23 1,24 1,25 1,29 1,31 1,33 1,34 1,35 1,38 1,39 1,40 1,41 1,44 1,45 1,46 1,47 1,49 1,72 1,79 1,84 1,90 1,99 1,103 8.076}
{0 CHEMBL214135,10 1,11 1,14 1,15 1,16 1,17 1,19 1,20 1,21 1,22 1,23 1,24 1,25 1,29 1,31 1,33 1,34 1,35 1,38 1,39 1,40 1,41 1,46 1,47 1,49 1,63 1,72 1,76 1,79 1,90 1,97 1,103 8.092}
{0 CHEMBL214469,10 1,11 1,14 1,15 1,16 1,17 1,19 1,20 1,21 1,22 1,23 1,24 1,25 1,29 1,31 1,33 1,34 1,35 1,38 1,39 1,40 1,41 1,45 1,46 1,47 1,49 1,63 1,72 1,76 1,79 1,90 1,100 1,103 8.174}
{0 CHEMBL214479,10 1,11 1,14 1,15 1,16 1,17 1,19 1,20 1,21 1,22 1,23 1,24 1,25 1,29 1,31 1,33 1,34 1,35 1,38 1,39 1,40 1,41 1,43 1,44 1,45 1,46 1,47 1,49 1,63 1,72 1,76 1,79 1,90 1,99 1,100 1,103 8.056}
{0 CHEMBL214500,10 1,11 1,14 1,15 1,16 1,17 1,19 1,20 1,21 1,22 1,23 1,24 1,25 1,29 1,31 1,33 1,34 1,35 1,38 1,39 1,40 1,41 1,43 1,44 1,45 1,46 1,47 1,49 1,63 1,72 1,76 1,79 1,90 1,99 1,100 1,103 8.201}
{0 CHEMBL214633,10 1,11 1,14 1,15 1,16 1,17 1,19 1,20 1,21 1,22 1,23 1,24 1,25 1,29 1,31 1,33 1,34 1,35 1,38 1,39 1,40 1,41 1,43 1,44 1,45 1,46 1,47 1,49 1,63 1,72 1,76 1,79 1,87 1,90 1,99 1,103 8.032}
{0 CHEMBL214662,10 1,11 1,14 1,15 1,16 1,17 1,19 1,20 1,21 1,22 1,23 1,24 1,25 1,29 1,31 1,33 1,34 1,35 1,38 1,39 1,40 1,41 1,46 1,47 1,49 1,58 1,61 1,62 1,72 1,79 1,90 1,97 1,103 8.114}
{0 CHEMBL214695,10 1,11 1,14 1,15 1,16 1,17 1,19 1,20 1,21 1,22 1,23 1,24 1,25 1,29 1,31 1,33 1,34 1,35 1,38 1,39 1,40 1,41 1,45 1,46 1,47 1,49 1,58 1,61 1,62 1,72 1,79 1,90 1,103 8.066}
{0 CHEMBL214786,10 1,11 1,14 1,15 1,16 1,17 1,19 1,20 1,21 1,22 1,23 1,24 1,25 1,29 1,31 1,33 1,34 1,35 1,38 1,39 1,40 1,41 1,45 1,46 1,47 1,49 1,58 1,61 1,62 1,72 1,79 1,90 1,100 1,103 8.086}
{0 CHEMBL214978,10 1,11 1,14 1,15 1,16 1,17 1,19 1,20 1,21 1,22 1,23 1,24 1,25 1,29 1,31 1,33 1,34 1,35 1,38 1,39 1,40 1,41 1,43 1,44 1,46 1,47 1,49 1,63 1,72 1,76 1,79 1,90 1,97 1,99 1,103 8.208}
{0 CHEMBL214980,10 1,11 1,14 1,15 1,16 1,17 1,19 1,20 1,21 1,22 1,23 1,24 1,25 1,29 1,31 1,33 1,34 1,35 1,38 1,39 1,40 1,41 1,45 1,46 1,47 1,49 1,58 1,61 1,62 1,72 1,79 1,87 1,90 1,103 7.989}
{0 CHEMBL215059,10 1,11 1,14 1,15 1,16 1,17 1,19 1,20 1,21 1,22 1,23 1,24 1,25 1,29 1,31 1,33 1,34 1,35 1,38 1,39 1,40 1,41 1,45 1,46 1,47 1,49 1,58 1,61 1,62 1,72 1,79 1,90 1,103 8.066}
{0 CHEMBL215068,10 1,11 1,14 1,15 1,16 1,17 1,19 1,20 1,21 1,22 1,23 1,24 1,25 1,29 1,31 1,33 1,34 1,35 1,38 1,39 1,40 1,41 1,44 1,45 1,46 1,47 1,49 1,72 1,79 1,84 1,87 1,90 1,99 1,103 8.032}
{0 CHEMBL215164,10 1,11 1,14 1,15 1,16 1,17 1,19 1,20 1,21 1,22 1,23 1,24 1,25 1,29 1,31 1,33 1,34 1,35 1,38 1,39 1,40 1,41 1,43 1,44 1,46 1,47 1,49 1,63 1,72 1,76 1,79 1,90 1,97 1,99 1,103 8.208}
{0 CHEMBL215173,10 1,11 1,14 1,15 1,16 1,17 1,19 1,20 1,21 1,22 1,23 1,24 1,25 1,29 1,31 1,33 1,34 1,35 1,38 1,39 1,40 1,41 1,45 1,46 1,47 1,49 1,63 1,72 1,76 1,79 1,90 1,103 8.174}
{0 CHEMBL215192,10 1,11 1,14 1,15 1,16 1,17 1,19 1,20 1,21 1,22 1,23 1,24 1,25 1,29 1,31 1,33 1,34 1,35 1,38 1,39 1,40 1,41 1,45 1,46 1,47 1,49 1,63 1,72 1,76 1,79 1,87 1,90 1,103 7.959}
{0 CHEMBL215199,10 1,11 1,14 1,15 1,16 1,17 1,19 1,20 1,21 1,22 1,23 1,24 1,25 1,29 1,31 1,33 1,34 1,35 1,38 1,39 1,40 1,41 1,46 1,47 1,49 1,58 1,61 1,62 1,72 1,79 1,90 1,97 1,103 8.036}
{0 CHEMBL215239,10 1,11 1,14 1,15 1,16 1,17 1,19 1,20 1,21 1,22 1,23 1,24 1,25 1,29 1,31 1,33 1,34 1,35 1,38 1,39 1,40 1,41 1,45 1,46 1,47 1,49 1,63 1,72 1,76 1,79 1,90 1,100 1,103 8.201}
{0 CHEMBL215260,10 1,11 1,14 1,15 1,16 1,17 1,19 1,20 1,21 1,22 1,23 1,24 1,25 1,29 1,31 1,33 1,34 1,35 1,38 1,39 1,40 1,41 1,43 1,44 1,45 1,46 1,47 1,49 1,63 1,72 1,76 1,79 1,90 1,99 1,100 1,103 8.056}
{0 CHEMBL215306,10 1,11 1,14 1,15 1,16 1,17 1,19 1,20 1,21 1,22 1,23 1,24 1,25 1,29 1,31 1,33 1,34 1,35 1,38 1,39 1,40 1,41 1,43 1,44 1,45 1,46 1,47 1,49 1,63 1,72 1,76 1,79 1,90 1,99 1,100 1,103 8.201}
{0 CHEMBL215360,10 1,11 1,14 1,15 1,16 1,17 1,19 1,20 1,21 1,22 1,23 1,24 1,25 1,29 1,31 1,33 1,34 1,35 1,38 1,39 1,40 1,41 1,44 1,45 1,46 1,47 1,49 1,72 1,79 1,84 1,90 1,99 1,100 1,103 8.201}
{0 CHEMBL215494,10 1,11 1,14 1,15 1,16 1,17 1,19 1,20 1,21 1,22 1,23 1,24 1,25 1,29 1,31 1,33 1,34 1,35 1,38 1,39 1,40 1,41 1,44 1,45 1,46 1,47 1,49 1,72 1,79 1,84 1,90 1,99 1,100 1,103 8.056}
{0 CHEMBL215518,10 1,11 1,14 1,15 1,16 1,17 1,19 1,20 1,21 1,22 1,23 1,24 1,25 1,29 1,31 1,33 1,34 1,35 1,38 1,39 1,40 1,41 1,45 1,46 1,47 1,49 1,63 1,72 1,76 1,79 1,90 1,103 8.174}
{0 CHEMBL215530,10 1,11 1,14 1,15 1,16 1,17 1,19 1,20 1,21 1,22 1,23 1,24 1,25 1,29 1,31 1,33 1,34 1,35 1,38 1,39 1,40 1,41 1,44 1,45 1,46 1,47 1,49 1,72 1,79 1,84 1,87 1,90 1,99 1,103 8.032}
{0 CHEMBL215537,10 1,11 1,14 1,15 1,16 1,17 1,19 1,20 1,21 1,22 1,23 1,24 1,25 1,29 1,31 1,33 1,34 1,35 1,38 1,39 1,40 1,41 1,45 1,46 1,47 1,49 1,58 1,61 1,62 1,72 1,79 1,87 1,90 1,103 7.991}
{0 CHEMBL215597,10 1,11 1,14 1,15 1,16 1,17 1,19 1,20 1,21 1,22 1,23 1,24 1,25 1,29 1,31 1,33 1,34 1,35 1,38 1,39 1,40 1,41 1,44 1,45 1,46 1,47 1,49 1,72 1,79 1,84 1,90 1,99 1,100 1,103 8.056}
{0 CHEMBL215773,10 1,11 1,14 1,15 1,16 1,17 1,19 1,20 1,21 1,22 1,23 1,24 1,25 1,29 1,31 1,33 1,34 1,35 1,38 1,39 1,40 1,41 1,44 1,45 1,46 1,47 1,49 1,72 1,79 1,84 1,90 1,99 1,100 1,103 8.056}
{0 CHEMBL215805,10 1,11 1,14 1,15 1,16 1,17 1,19 1,20 1,21 1,22 1,23 1,24 1,25 1,29 1,31 1,33 1,34 1,35 1,38 1,39 1,40 1,41 1,44 1,45 1,46 1,47 1,49 1,72 1,79 1,84 1,90 1,99 1,103 8.076}
{0 CHEMBL215806,10 1,11 1,14 1,15 1,16 1,17 1,19 1,20 1,21 1,22 1,23 1,24 1,25 1,29 1,31 1,33 1,34 1,35 1,38 1,39 1,40 1,41 1,46 1,47 1,49 1,63 1,72 1,76 1,79 1,90 1,97 1,103 8.167}
{0 CHEMBL215968,10 1,11 1,14 1,15 1,16 1,17 1,19 1,20 1,21 1,22 1,23 1,24 1,25 1,29 1,31 1,33 1,34 1,35 1,38 1,39 1,40 1,41 1,45 1,46 1,47 1,49 1,63 1,72 1,76 1,79 1,90 1,103 8.174}
{0 CHEMBL216037,10 1,11 1,14 1,15 1,16 1,17 1,19 1,20 1,21 1,22 1,23 1,24 1,25 1,29 1,31 1,33 1,34 1,35 1,38 1,39 1,40 1,41 1,45 1,46 1,47 1,49 1,58 1,61 1,62 1,72 1,79 1,90 1,100 1,103 8.222}
{0 CHEMBL216199,10 1,11 1,14 1,15 1,16 1,17 1,19 1,20 1,21 1,22 1,23 1,24 1,25 1,29 1,31 1,33 1,34 1,35 1,38 1,39 1,40 1,41 1,45 1,46 1,47 1,49 1,58 1,61 1,62 1,72 1,79 1,87 1,90 1,103 8.032}
{0 CHEMBL216776,10 1,11 1,14 1,15 1,16 1,17 1,19 1,20 1,21 1,22 1,23 1,24 1,25 1,29 1,31 1,33 1,34 1,35 1,38 1,39 1,40 1,41 1,45 1,46 1,47 1,49 1,63 1,72 1,76 1,79 1,87 1,90 1,103 7.979}
{0 CHEMBL2170202,10 1,11 1,14 1,15 1,16 1,17 1,19 1,20 1,21 1,22 1,23 1,24 1,25 1,29 1,33 1,34 1,36 1,47 1,58 1,62 1,72 1,79 1,103 8.523}
{0 CHEMBL217024,10 1,11 1,14 1,15 1,16 1,17 1,19 1,20 1,21 1,22 1,23 1,24 1,25 1,29 1,31 1,33 1,34 1,35 1,38 1,39 1,40 1,41 1,45 1,46 1,47 1,49 1,58 1,61 1,62 1,72 1,79 1,90 1,103 8.066}
{0 CHEMBL217030,10 1,11 1,14 1,15 1,16 1,17 1,19 1,20 1,21 1,22 1,23 1,24 1,25 1,29 1,31 1,33 1,34 1,35 1,38 1,39 1,40 1,41 1,45 1,46 1,47 1,49 1,63 1,72 1,76 1,79 1,90 1,103 8.174}
{0 CHEMBL217031,10 1,11 1,14 1,15 1,16 1,17 1,19 1,20 1,21 1,22 1,23 1,24 1,25 1,29 1,31 1,33 1,34 1,35 1,38 1,39 1,40 1,41 1,43 1,44 1,45 1,46 1,47 1,49 1,63 1,72 1,76 1,79 1,90 1,99 1,103 8.076}
{0 CHEMBL2171446,8 1,10 1,12 1,13 1,16 1,18 1,25 1,32 1,34 1,50 1,72 1,79 1,82 1,89 1,103 7.31}
{0 CHEMBL2171447,8 1,10 1,12 1,13 1,16 1,18 1,25 1,32 1,36 1,50 1,72 1,79 1,103 8.662}
{0 CHEMBL2171448,8 1,10 1,12 1,13 1,16 1,18 1,25 1,32 1,34 1,50 1,72 1,79 1,82 1,89 1,103 8.301}
{0 CHEMBL2171449,10 1,12 1,13 1,18 1,32 1,34 1,51 1,72 1,79 1,82 1,103 8.658}
{0 CHEMBL2171450,10 1,12 1,13 1,18 1,32 1,36 1,72 1,79 1,103 9.301}
{0 CHEMBL217231,10 1,11 1,14 1,15 1,16 1,17 1,19 1,20 1,21 1,22 1,23 1,24 1,25 1,29 1,31 1,33 1,34 1,35 1,38 1,39 1,40 1,41 1,45 1,46 1,47 1,49 1,63 1,72 1,76 1,79 1,87 1,90 1,103 7.959}
{0 CHEMBL2172537,10 1,11 1,14 1,15 1,16 1,17 1,19 1,20 1,21 1,22 1,25 1,29 1,31 1,33 1,34 1,35 1,39 1,43 1,44 1,47 1,58 1,61 1,62 1,72 1,79 1,99 1,103 7.804}
{0 CHEMBL2172538,10 1,11 1,14 1,15 1,16 1,17 1,19 1,20 1,21 1,22 1,25 1,29 1,31 1,33 1,34 1,35 1,39 1,44 1,47 1,58 1,61 1,62 1,72 1,79 1,99 1,103 7.564}
{0 CHEMBL2172539,10 1,11 1,14 1,15 1,16 1,17 1,19 1,20 1,21 1,22 1,25 1,29 1,31 1,33 1,34 1,35 1,47 1,58 1,61 1,62 1,72 1,79 1,99 1,103 7.68}
{0 CHEMBL217265,10 1,11 1,14 1,15 1,16 1,17 1,19 1,20 1,21 1,22 1,23 1,24 1,25 1,29 1,31 1,33 1,34 1,35 1,38 1,39 1,40 1,41 1,45 1,46 1,47 1,49 1,58 1,61 1,62 1,72 1,79 1,90 1,100 1,103 8.086}
{0 CHEMBL217283,10 1,11 1,14 1,15 1,16 1,17 1,19 1,20 1,21 1,22 1,23 1,24 1,25 1,29 1,31 1,33 1,34 1,35 1,38 1,39 1,40 1,41 1,43 1,44 1,45 1,46 1,47 1,49 1,63 1,72 1,76 1,79 1,90 1,99 1,103 8.076}
{0 CHEMBL217335,10 1,11 1,14 1,15 1,16 1,17 1,19 1,20 1,21 1,22 1,23 1,24 1,25 1,29 1,31 1,33 1,34 1,35 1,38 1,39 1,40 1,41 1,45 1,46 1,47 1,49 1,63 1,72 1,76 1,79 1,90 1,100 1,103 8.174}
{0 CHEMBL217385,10 1,11 1,14 1,15 1,16 1,17 1,19 1,20 1,21 1,22 1,23 1,24 1,25 1,29 1,31 1,33 1,34 1,35 1,38 1,39 1,40 1,41 1,43 1,44 1,46 1,47 1,49 1,63 1,72 1,76 1,79 1,90 1,97 1,99 1,103 8.208}
{0 CHEMBL217417,10 1,11 1,14 1,15 1,16 1,17 1,19 1,20 1,21 1,22 1,23 1,24 1,25 1,29 1,31 1,33 1,34 1,35 1,38 1,39 1,40 1,41 1,44 1,45 1,46 1,47 1,49 1,72 1,79 1,84 1,90 1,99 1,100 1,103 8.201}
{0 CHEMBL217447,10 1,11 1,14 1,15 1,16 1,17 1,19 1,20 1,21 1,22 1,23 1,24 1,25 1,29 1,31 1,33 1,34 1,35 1,38 1,39 1,40 1,41 1,45 1,46 1,47 1,49 1,63 1,72 1,76 1,79 1,90 1,100 1,103 8.201}
{0 CHEMBL217558,10 1,11 1,14 1,15 1,16 1,17 1,19 1,20 1,21 1,22 1,23 1,24 1,25 1,29 1,31 1,33 1,34 1,35 1,38 1,39 1,40 1,41 1,43 1,44 1,45 1,46 1,47 1,49 1,63 1,72 1,76 1,79 1,90 1,99 1,100 1,103 8.056}
{0 CHEMBL217764,10 1,11 1,14 1,15 1,16 1,17 1,19 1,20 1,21 1,22 1,23 1,24 1,25 1,29 1,31 1,33 1,34 1,35 1,38 1,39 1,40 1,41 1,43 1,44 1,45 1,46 1,47 1,49 1,63 1,72 1,76 1,79 1,87 1,90 1,99 1,103 8.032}
{0 CHEMBL217876,10 1,11 1,14 1,15 1,16 1,17 1,19 1,20 1,21 1,22 1,23 1,24 1,25 1,29 1,31 1,33 1,34 1,35 1,38 1,39 1,40 1,41 1,45 1,46 1,47 1,49 1,63 1,72 1,76 1,79 1,87 1,90 1,103 7.977}
{0 CHEMBL217888,10 1,11 1,14 1,15 1,16 1,17 1,19 1,20 1,21 1,22 1,23 1,24 1,25 1,29 1,31 1,33 1,34 1,35 1,38 1,39 1,40 1,41 1,43 1,44 1,45 1,46 1,47 1,49 1,63 1,72 1,76 1,79 1,87 1,90 1,99 1,103 8.032}
{0 CHEMBL217924,10 1,11 1,14 1,15 1,16 1,17 1,19 1,20 1,21 1,22 1,23 1,24 1,25 1,29 1,31 1,33 1,34 1,35 1,38 1,39 1,40 1,41 1,44 1,46 1,47 1,49 1,72 1,79 1,84 1,90 1,97 1,99 1,103 8.215}
{0 CHEMBL218183,10 1,11 1,14 1,15 1,16 1,17 1,19 1,20 1,21 1,22 1,23 1,24 1,25 1,29 1,31 1,33 1,34 1,35 1,38 1,39 1,40 1,41 1,44 1,45 1,46 1,47 1,49 1,72 1,79 1,84 1,90 1,99 1,103 8.076}
{0 CHEMBL218565,10 1,11 1,14 1,15 1,16 1,17 1,19 1,20 1,21 1,22 1,23 1,24 1,25 1,29 1,31 1,33 1,34 1,35 1,38 1,39 1,40 1,41 1,44 1,45 1,46 1,47 1,49 1,72 1,79 1,84 1,90 1,99 1,100 1,103 8.201}
{0 CHEMBL219315,10 1,11 1,14 1,15 1,16 1,17 1,19 1,20 1,21 1,22 1,23 1,24 1,25 1,29 1,31 1,33 1,34 1,39 1,47 1,58 1,72 1,77 1,79 1,103 7.523}
{0 CHEMBL220140,10 1,11 1,14 1,15 1,16 1,17 1,19 1,20 1,21 1,23 1,25 1,29 1,31 1,33 1,34 1,47 1,58 1,72 1,77 1,79 1,103 7.301}
{0 CHEMBL226328,10 1,11 1,14 1,15 1,16 1,17 1,19 1,20 1,21 1,22 1,23 1,24 1,29 1,33 1,34 1,39 1,47 1,62 1,72 1,79 1,103 9.301}
{0 CHEMBL226380,10 1,11 1,14 1,15 1,16 1,17 1,19 1,20 1,21 1,22 1,23 1,24 1,29 1,33 1,34 1,39 1,47 1,62 1,72 1,79 1,103 10.155}
{0 CHEMBL226435,10 1,11 1,14 1,15 1,16 1,17 1,19 1,20 1,21 1,22 1,23 1,24 1,29 1,33 1,34 1,39 1,47 1,62 1,72 1,79 1,103 8.658}
{0 CHEMBL2325041,12 1,13 1,18 1,29 1,32 1,34 1,42 1,48 1,50 1,52 1,55 1,56 1,64 1,65 1,66 1,68 1,69 1,72 1,77 1,78 1,79 1,83 1,84 1,87 1,89 1,90 1,103 4.523}
{0 CHEMBL2325042,12 1,13 1,18 1,29 1,34 1,42 1,48 1,52 1,55 1,56 1,64 1,65 1,66 1,68 1,69 1,72 1,77 1,78 1,79 1,83 1,84 1,87 1,89 1,90 1,103 4.523}
{0 CHEMBL2325044,12 1,13 1,18 1,25 1,29 1,32 1,34 1,42 1,48 1,52 1,55 1,56 1,64 1,65 1,66 1,68 1,69 1,72 1,77 1,78 1,79 1,83 1,84 1,87 1,89 1,90 1,103 4.523}
{0 CHEMBL2325046,12 1,13 1,18 1,29 1,32 1,34 1,36 1,42 1,48 1,52 1,55 1,56 1,64 1,65 1,66 1,68 1,69 1,72 1,77 1,78 1,79 1,83 1,84 1,87 1,89 1,90 1,103 4.523}
{0 CHEMBL2325047,10 1,12 1,13 1,16 1,18 1,29 1,32 1,34 1,42 1,48 1,52 1,55 1,56 1,64 1,65 1,66 1,68 1,69 1,72 1,77 1,78 1,79 1,83 1,84 1,87 1,89 1,90 1,99 1,103 4.523}
{0 CHEMBL2325048,10 1,12 1,13 1,16 1,18 1,29 1,32 1,34 1,42 1,44 1,48 1,52 1,55 1,56 1,64 1,65 1,66 1,68 1,69 1,72 1,77 1,78 1,79 1,83 1,84 1,87 1,89 1,90 1,99 1,103 4.523}
{0 CHEMBL2325049,10 1,12 1,13 1,18 1,29 1,32 1,34 1,36 1,42 1,44 1,48 1,52 1,55 1,56 1,64 1,65 1,66 1,68 1,69 1,72 1,77 1,78 1,79 1,83 1,84 1,87 1,89 1,90 1,99 1,103 4.523}
{0 CHEMBL2325051,12 1,13 1,18 1,29 1,32 1,34 1,42 1,48 1,52 1,55 1,56 1,64 1,65 1,66 1,68 1,69 1,72 1,77 1,78 1,79 1,83 1,84 1,87 1,89 1,90 1,103 4.523}
{0 CHEMBL2325052,12 1,13 1,18 1,29 1,34 1,42 1,48 1,52 1,55 1,56 1,64 1,65 1,66 1,68 1,69 1,72 1,77 1,78 1,79 1,84 1,87 1,89 1,90 1,101 1,103 4.523}
{0 CHEMBL2325053,12 1,13 1,16 1,18 1,29 1,34 1,42 1,48 1,52 1,55 1,56 1,64 1,65 1,66 1,68 1,69 1,72 1,77 1,78 1,79 1,84 1,87 1,89 1,90 1,103 4.523}
{0 CHEMBL2325055,12 1,13 1,18 1,29 1,34 1,42 1,48 1,52 1,55 1,56 1,64 1,65 1,66 1,68 1,69 1,72 1,77 1,78 1,79 1,84 1,87 1,89 1,90 1,99 1,100 1,103 4.602}
{0 CHEMBL2325056,12 1,13 1,18 1,29 1,33 1,34 1,42 1,48 1,52 1,55 1,56 1,64 1,65 1,66 1,68 1,69 1,72 1,77 1,78 1,79 1,84 1,87 1,89 1,90 1,99 1,100 1,103 4.523}
{0 CHEMBL2325057,12 1,13 1,18 1,29 1,34 1,42 1,48 1,50 1,52 1,55 1,56 1,64 1,65 1,66 1,68 1,69 1,72 1,77 1,78 1,79 1,84 1,87 1,89 1,90 1,103 4.62}
{0 CHEMBL2325058,12 1,13 1,18 1,29 1,32 1,34 1,42 1,48 1,52 1,55 1,56 1,64 1,65 1,66 1,68 1,69 1,72 1,77 1,78 1,79 1,84 1,87 1,88 1,89 1,90 1,92 1,103 4.854}
{0 CHEMBL2325059,12 1,13 1,18 1,29 1,32 1,34 1,42 1,48 1,52 1,55 1,56 1,64 1,65 1,66 1,68 1,69 1,72 1,77 1,78 1,79 1,84 1,87 1,89 1,90 1,103 4.523}
{0 CHEMBL2325060,10 1,12 1,13 1,18 1,29 1,32 1,34 1,42 1,48 1,52 1,55 1,56 1,64 1,65 1,66 1,68 1,69 1,72 1,77 1,78 1,79 1,84 1,85 1,87 1,88 1,89 1,90 1,92 1,99 1,103 4.699}
{0 CHEMBL2334341,12 1,13 1,18 1,32 1,34 1,47 1,49 1,72 1,79 1,84 1,103 7.398}
{0 CHEMBL2346688,1 1,2 1,3 1,4 1,5 1,6 1,7 1,8 1,9 1,12 1,13 1,18 1,32 1,34 1,36 1,42 1,43 1,44 1,48 1,52 1,54 1,67 1,72 1,73 1,79 1,80 1,84 1,85 1,88 1,90 1,92 1,103 4.222}
{0 CHEMBL2348866,1 1,2 1,3 1,4 1,5 1,6 1,7 1,8 1,9 1,10 1,12 1,13 1,18 1,26 1,27 1,28 1,30 1,32 1,34 1,36 1,37 1,43 1,44 1,72 1,79 1,99 1,103 4.222}
{0 CHEMBL2348867,1 1,2 1,3 1,4 1,5 1,6 1,7 1,8 1,9 1,12 1,13 1,18 1,26 1,27 1,28 1,30 1,32 1,36 1,37 1,42 1,43 1,44 1,50 1,78 1,79 1,81 1,84 1,89 1,90 1,93 1,99 1,103 4.301}
{0 CHEMBL2348868,1 1,2 1,3 1,4 1,5 1,6 1,7 1,8 1,9 1,12 1,13 1,18 1,26 1,27 1,28 1,30 1,32 1,36 1,37 1,43 1,44 1,47 1,50 1,57 1,79 1,90 1,93 1,98 1,99 1,103 4.222}
{0 CHEMBL2348869,1 1,2 1,3 1,4 1,5 1,6 1,7 1,8 1,9 1,12 1,13 1,18 1,26 1,27 1,28 1,30 1,32 1,36 1,37 1,43 1,44 1,47 1,50 1,72 1,79 1,84 1,90 1,93 1,98 1,99 1,103 4.222}
{0 CHEMBL2348870,1 1,2 1,3 1,4 1,5 1,6 1,7 1,8 1,9 1,12 1,13 1,18 1,26 1,27 1,28 1,30 1,32 1,36 1,37 1,43 1,44 1,47 1,50 1,79 1,90 1,93 1,98 1,99 1,103 4.222}
{0 CHEMBL2348871,1 1,2 1,3 1,4 1,5 1,6 1,7 1,8 1,9 1,12 1,13 1,18 1,26 1,27 1,28 1,30 1,32 1,36 1,37 1,42 1,43 1,44 1,50 1,57 1,78 1,79 1,90 1,93 1,99 1,103 4.222}
{0 CHEMBL2348872,1 1,2 1,3 1,4 1,5 1,6 1,7 1,8 1,9 1,12 1,13 1,18 1,26 1,27 1,28 1,30 1,32 1,36 1,37 1,42 1,43 1,44 1,50 1,57 1,76 1,78 1,79 1,90 1,93 1,99 1,103 4.222}
{0 CHEMBL2348873,1 1,2 1,3 1,4 1,5 1,6 1,7 1,8 1,9 1,12 1,13 1,18 1,26 1,27 1,28 1,30 1,32 1,36 1,37 1,42 1,43 1,44 1,50 1,57 1,78 1,79 1,90 1,93 1,99 1,103 4.222}
{0 CHEMBL2348874,1 1,2 1,3 1,4 1,5 1,6 1,7 1,8 1,9 1,12 1,13 1,18 1,26 1,27 1,28 1,30 1,32 1,36 1,37 1,42 1,43 1,44 1,50 1,78 1,79 1,90 1,93 1,99 1,103 4.222}
{0 CHEMBL2348875,1 1,2 1,3 1,4 1,5 1,6 1,7 1,8 1,9 1,12 1,13 1,18 1,26 1,27 1,28 1,30 1,32 1,36 1,37 1,42 1,43 1,44 1,50 1,52 1,54 1,72 1,79 1,84 1,90 1,93 1,99 1,103 4.432}
{0 CHEMBL2348876,1 1,2 1,3 1,4 1,5 1,6 1,7 1,8 1,9 1,12 1,13 1,18 1,26 1,27 1,28 1,30 1,32 1,36 1,37 1,42 1,43 1,44 1,49 1,79 1,90 1,93 1,99 1,100 1,103 4.222}
{0 CHEMBL2348877,1 1,2 1,3 1,4 1,5 1,6 1,7 1,8 1,9 1,12 1,13 1,18 1,26 1,27 1,28 1,30 1,32 1,36 1,37 1,42 1,43 1,44 1,47 1,50 1,54 1,79 1,81 1,84 1,86 1,90 1,93 1,94 1,98 1,99 1,103 4.222}
{0 CHEMBL2348878,1 1,2 1,3 1,4 1,5 1,6 1,7 1,8 1,9 1,12 1,13 1,18 1,26 1,27 1,28 1,30 1,32 1,36 1,37 1,42 1,43 1,44 1,47 1,50 1,54 1,79 1,81 1,84 1,86 1,90 1,93 1,94 1,99 1,103 4.222}
{0 CHEMBL2348879,1 1,2 1,3 1,4 1,5 1,6 1,7 1,8 1,9 1,12 1,13 1,18 1,26 1,27 1,28 1,30 1,32 1,36 1,37 1,42 1,43 1,44 1,47 1,54 1,79 1,81 1,84 1,86 1,90 1,93 1,94 1,98 1,99 1,103 4.292}
{0 CHEMBL2348880,1 1,2 1,3 1,4 1,5 1,6 1,7 1,8 1,9 1,12 1,13 1,18 1,26 1,27 1,28 1,30 1,32 1,36 1,37 1,42 1,43 1,44 1,47 1,54 1,79 1,81 1,84 1,86 1,90 1,93 1,94 1,98 1,99 1,103 4.222}
{0 CHEMBL2348881,1 1,2 1,3 1,4 1,5 1,6 1,7 1,8 1,9 1,12 1,13 1,18 1,26 1,27 1,28 1,30 1,32 1,33 1,36 1,37 1,42 1,43 1,44 1,52 1,54 1,72 1,79 1,84 1,90 1,93 1,99 1,103 4.222}
{0 CHEMBL2348882,1 1,2 1,3 1,4 1,5 1,6 1,7 1,8 1,9 1,12 1,13 1,18 1,26 1,27 1,28 1,30 1,32 1,34 1,36 1,37 1,42 1,43 1,44 1,48 1,52 1,54 1,72 1,79 1,84 1,90 1,93 1,99 1,103 4.222}
{0 CHEMBL2348883,1 1,2 1,3 1,4 1,5 1,6 1,7 1,8 1,9 1,12 1,13 1,18 1,26 1,27 1,28 1,30 1,32 1,36 1,37 1,42 1,43 1,44 1,54 1,79 1,84 1,90 1,93 1,99 1,103 4.222}
{0 CHEMBL2348884,1 1,2 1,3 1,4 1,5 1,6 1,7 1,8 1,9 1,12 1,13 1,18 1,26 1,27 1,28 1,30 1,32 1,34 1,36 1,37 1,43 1,44 1,53 1,72 1,79 1,95 1,99 1,103 4.357}
{0 CHEMBL2348885,1 1,2 1,3 1,4 1,5 1,6 1,7 1,8 1,9 1,12 1,13 1,18 1,26 1,27 1,28 1,30 1,32 1,36 1,37 1,42 1,43 1,44 1,50 1,51 1,53 1,72 1,75 1,78 1,79 1,81 1,84 1,89 1,90 1,99 1,103 4.222}
{0 CHEMBL2348886,1 1,2 1,3 1,4 1,5 1,6 1,7 1,8 1,9 1,12 1,13 1,18 1,26 1,27 1,28 1,30 1,32 1,36 1,37 1,43 1,44 1,47 1,50 1,53 1,57 1,72 1,75 1,79 1,90 1,98 1,99 1,103 4.222}
{0 CHEMBL2348887,1 1,2 1,3 1,4 1,5 1,6 1,7 1,8 1,9 1,12 1,13 1,18 1,26 1,27 1,28 1,30 1,32 1,36 1,37 1,43 1,44 1,47 1,50 1,53 1,72 1,75 1,79 1,84 1,90 1,98 1,99 1,103 4.398}
{0 CHEMBL2348888,1 1,2 1,3 1,4 1,5 1,6 1,7 1,8 1,9 1,12 1,13 1,18 1,26 1,27 1,28 1,30 1,32 1,36 1,37 1,42 1,43 1,44 1,50 1,51 1,53 1,57 1,72 1,75 1,78 1,79 1,90 1,99 1,103 4.222}
{0 CHEMBL2348889,1 1,2 1,3 1,4 1,5 1,6 1,7 1,8 1,9 1,12 1,13 1,18 1,26 1,27 1,28 1,30 1,32 1,36 1,37 1,42 1,43 1,44 1,50 1,51 1,53 1,57 1,72 1,75 1,76 1,78 1,79 1,90 1,99 1,103 4.222}
{0 CHEMBL2348890,1 1,2 1,3 1,4 1,5 1,6 1,7 1,8 1,9 1,12 1,13 1,18 1,26 1,27 1,28 1,30 1,32 1,36 1,37 1,42 1,43 1,44 1,50 1,51 1,53 1,57 1,72 1,75 1,78 1,79 1,90 1,99 1,103 4.222}
{0 CHEMBL2348891,1 1,2 1,3 1,4 1,5 1,6 1,7 1,8 1,9 1,12 1,13 1,18 1,26 1,27 1,28 1,30 1,32 1,36 1,37 1,42 1,43 1,44 1,50 1,51 1,53 1,72 1,75 1,78 1,79 1,90 1,99 1,103 4.42}
{0 CHEMBL2348892,1 1,2 1,3 1,4 1,5 1,6 1,7 1,8 1,9 1,12 1,13 1,18 1,26 1,27 1,28 1,30 1,32 1,36 1,37 1,42 1,43 1,44 1,50 1,51 1,52 1,53 1,54 1,72 1,75 1,79 1,84 1,90 1,99 1,103 4.222}
{0 CHEMBL2348893,1 1,2 1,3 1,4 1,5 1,6 1,7 1,8 1,9 1,12 1,13 1,18 1,26 1,27 1,28 1,30 1,32 1,36 1,37 1,42 1,43 1,44 1,49 1,51 1,53 1,72 1,75 1,79 1,90 1,99 1,100 1,103 4.222}
{0 CHEMBL2348894,1 1,2 1,3 1,4 1,5 1,6 1,7 1,8 1,9 1,12 1,13 1,18 1,26 1,27 1,28 1,30 1,32 1,36 1,37 1,42 1,43 1,44 1,47 1,50 1,51 1,53 1,54 1,72 1,75 1,79 1,81 1,84 1,86 1,90 1,94 1,98 1,99 1,103 4.222}
{0 CHEMBL2348895,1 1,2 1,3 1,4 1,5 1,6 1,7 1,8 1,9 1,12 1,13 1,18 1,26 1,27 1,28 1,30 1,32 1,36 1,37 1,42 1,43 1,44 1,47 1,51 1,53 1,54 1,72 1,75 1,79 1,81 1,84 1,86 1,90 1,94 1,98 1,99 1,103 4.222}
{0 CHEMBL2348896,1 1,2 1,3 1,4 1,5 1,6 1,7 1,8 1,9 1,12 1,13 1,18 1,26 1,27 1,28 1,30 1,32 1,36 1,37 1,42 1,43 1,44 1,47 1,50 1,51 1,53 1,54 1,72 1,75 1,79 1,81 1,84 1,86 1,90 1,94 1,99 1,103 4.18}
{0 CHEMBL2348897,1 1,2 1,3 1,4 1,5 1,6 1,7 1,8 1,9 1,12 1,13 1,18 1,26 1,27 1,28 1,30 1,32 1,36 1,37 1,42 1,43 1,44 1,47 1,51 1,53 1,54 1,72 1,75 1,79 1,81 1,84 1,86 1,90 1,94 1,98 1,99 1,103 4.222}
{0 CHEMBL2348898,1 1,2 1,3 1,4 1,5 1,6 1,7 1,8 1,9 1,12 1,13 1,18 1,26 1,27 1,28 1,30 1,32 1,36 1,37 1,42 1,43 1,44 1,47 1,51 1,53 1,54 1,72 1,75 1,79 1,81 1,84 1,86 1,90 1,94 1,98 1,99 1,103 4.222}
{0 CHEMBL2348899,1 1,2 1,3 1,4 1,5 1,6 1,7 1,8 1,9 1,12 1,13 1,18 1,26 1,27 1,28 1,30 1,32 1,33 1,36 1,37 1,42 1,43 1,44 1,51 1,52 1,53 1,54 1,72 1,75 1,79 1,84 1,90 1,99 1,103 4.222}
{0 CHEMBL2348900,1 1,2 1,3 1,4 1,5 1,6 1,7 1,8 1,9 1,12 1,13 1,18 1,26 1,27 1,28 1,30 1,32 1,34 1,36 1,37 1,42 1,43 1,44 1,48 1,51 1,52 1,53 1,54 1,72 1,75 1,79 1,84 1,90 1,99 1,103 4.222}
{0 CHEMBL2348901,1 1,2 1,3 1,4 1,5 1,6 1,7 1,8 1,9 1,12 1,13 1,18 1,26 1,27 1,28 1,30 1,32 1,36 1,37 1,43 1,44 1,47 1,50 1,53 1,72 1,75 1,79 1,81 1,84 1,90 1,99 1,103 4.222}
{0 CHEMBL2348902,1 1,2 1,3 1,4 1,5 1,6 1,7 1,8 1,9 1,12 1,13 1,18 1,26 1,27 1,28 1,30 1,32 1,36 1,37 1,42 1,43 1,44 1,50 1,51 1,53 1,72 1,75 1,78 1,79 1,90 1,99 1,103 4.222}
{0 CHEMBL2348903,1 1,2 1,3 1,4 1,5 1,6 1,7 1,8 1,9 1,12 1,13 1,18 1,26 1,27 1,28 1,30 1,32 1,36 1,37 1,43 1,44 1,47 1,49 1,50 1,53 1,72 1,75 1,79 1,90 1,99 1,103 4.26}
{0 CHEMBL2348904,1 1,2 1,3 1,4 1,5 1,6 1,7 1,8 1,9 1,12 1,13 1,18 1,26 1,27 1,28 1,30 1,32 1,36 1,37 1,43 1,44 1,47 1,50 1,53 1,72 1,75 1,79 1,84 1,90 1,99 1,103 4.222}
{0 CHEMBL2348905,1 1,2 1,3 1,4 1,5 1,6 1,7 1,8 1,9 1,12 1,13 1,18 1,26 1,27 1,28 1,30 1,32 1,34 1,36 1,37 1,43 1,44 1,53 1,60 1,72 1,79 1,99 1,103 4.222}
{0 CHEMBL2348906,1 1,2 1,3 1,4 1,5 1,6 1,7 1,8 1,9 1,12 1,13 1,18 1,26 1,27 1,28 1,30 1,32 1,36 1,37 1,42 1,43 1,44 1,50 1,51 1,53 1,71 1,72 1,78 1,79 1,81 1,84 1,89 1,90 1,99 1,103 4.222}
{0 CHEMBL2348907,1 1,2 1,3 1,4 1,5 1,6 1,7 1,8 1,9 1,12 1,13 1,18 1,26 1,27 1,28 1,30 1,32 1,36 1,37 1,43 1,44 1,47 1,50 1,53 1,57 1,71 1,72 1,79 1,90 1,98 1,99 1,103 4.222}
{0 CHEMBL2348908,1 1,2 1,3 1,4 1,5 1,6 1,7 1,8 1,9 1,12 1,13 1,18 1,26 1,27 1,28 1,30 1,32 1,36 1,37 1,43 1,44 1,47 1,50 1,53 1,71 1,72 1,79 1,84 1,90 1,98 1,99 1,103 4.222}
{0 CHEMBL2348909,1 1,2 1,3 1,4 1,5 1,6 1,7 1,8 1,9 1,12 1,13 1,18 1,26 1,27 1,28 1,30 1,32 1,36 1,37 1,42 1,43 1,44 1,50 1,51 1,53 1,57 1,71 1,72 1,78 1,79 1,90 1,99 1,103 4.222}
{0 CHEMBL2348910,1 1,2 1,3 1,4 1,5 1,6 1,7 1,8 1,9 1,12 1,13 1,18 1,26 1,27 1,28 1,30 1,32 1,36 1,37 1,42 1,43 1,44 1,50 1,51 1,53 1,57 1,71 1,72 1,76 1,78 1,79 1,90 1,99 1,103 4.222}
{0 CHEMBL2348911,1 1,2 1,3 1,4 1,5 1,6 1,7 1,8 1,9 1,12 1,13 1,18 1,26 1,27 1,28 1,30 1,32 1,36 1,37 1,42 1,43 1,44 1,50 1,51 1,53 1,57 1,71 1,72 1,78 1,79 1,90 1,99 1,103 4.222}
{0 CHEMBL2348912,1 1,2 1,3 1,4 1,5 1,6 1,7 1,8 1,9 1,12 1,13 1,18 1,26 1,27 1,28 1,30 1,32 1,36 1,37 1,42 1,43 1,44 1,50 1,51 1,53 1,71 1,72 1,78 1,79 1,90 1,99 1,103 4.222}
{0 CHEMBL2348913,1 1,2 1,3 1,4 1,5 1,6 1,7 1,8 1,9 1,12 1,13 1,18 1,26 1,27 1,28 1,30 1,32 1,36 1,37 1,42 1,43 1,44 1,50 1,51 1,52 1,53 1,54 1,71 1,72 1,79 1,84 1,90 1,99 1,103 4.222}
{0 CHEMBL2348914,1 1,2 1,3 1,4 1,5 1,6 1,7 1,8 1,9 1,12 1,13 1,18 1,26 1,27 1,28 1,30 1,32 1,36 1,37 1,42 1,43 1,44 1,47 1,50 1,51 1,53 1,54 1,71 1,72 1,79 1,81 1,84 1,86 1,90 1,94 1,98 1,99 1,103 4.222}
{0 CHEMBL2348915,1 1,2 1,3 1,4 1,5 1,6 1,7 1,8 1,9 1,12 1,13 1,18 1,26 1,27 1,28 1,30 1,32 1,36 1,37 1,42 1,43 1,44 1,47 1,51 1,53 1,54 1,71 1,72 1,79 1,81 1,84 1,86 1,90 1,94 1,98 1,99 1,103 4.222}
{0 CHEMBL2348916,1 1,2 1,3 1,4 1,5 1,6 1,7 1,8 1,9 1,12 1,13 1,18 1,26 1,27 1,28 1,30 1,32 1,36 1,37 1,42 1,43 1,44 1,47 1,50 1,51 1,53 1,54 1,71 1,72 1,79 1,81 1,84 1,86 1,90 1,94 1,99 1,103 4.222}
{0 CHEMBL2348917,1 1,2 1,3 1,4 1,5 1,6 1,7 1,8 1,9 1,12 1,13 1,18 1,26 1,27 1,28 1,30 1,32 1,36 1,37 1,42 1,43 1,44 1,47 1,51 1,53 1,54 1,71 1,72 1,79 1,81 1,84 1,86 1,90 1,94 1,98 1,99 1,103 4.187}
{0 CHEMBL2348918,1 1,2 1,3 1,4 1,5 1,6 1,7 1,8 1,9 1,12 1,13 1,18 1,26 1,27 1,28 1,30 1,32 1,36 1,37 1,42 1,43 1,44 1,47 1,51 1,53 1,54 1,71 1,72 1,79 1,81 1,84 1,86 1,90 1,94 1,98 1,99 1,103 5.155}
{0 CHEMBL2348919,1 1,2 1,3 1,4 1,5 1,6 1,7 1,8 1,9 1,12 1,13 1,18 1,26 1,27 1,28 1,30 1,32 1,33 1,36 1,37 1,42 1,43 1,44 1,51 1,52 1,53 1,54 1,71 1,72 1,79 1,84 1,90 1,99 1,103 4.222}
{0 CHEMBL2348920,1 1,2 1,3 1,4 1,5 1,6 1,7 1,8 1,9 1,12 1,13 1,18 1,26 1,27 1,28 1,30 1,32 1,34 1,36 1,37 1,42 1,43 1,44 1,48 1,51 1,52 1,53 1,54 1,71 1,72 1,79 1,84 1,90 1,99 1,103 4.222}
{0 CHEMBL2348921,1 1,2 1,3 1,4 1,5 1,6 1,7 1,8 1,9 1,12 1,13 1,18 1,26 1,27 1,28 1,30 1,32 1,36 1,37 1,43 1,44 1,47 1,50 1,53 1,71 1,72 1,79 1,81 1,84 1,90 1,99 1,103 4.222}
{0 CHEMBL2348922,1 1,2 1,3 1,4 1,5 1,6 1,7 1,8 1,9 1,12 1,13 1,18 1,26 1,27 1,28 1,30 1,32 1,36 1,37 1,42 1,43 1,44 1,50 1,51 1,53 1,71 1,72 1,78 1,79 1,90 1,99 1,103 4.222}
{0 CHEMBL2348923,1 1,2 1,3 1,4 1,5 1,6 1,7 1,8 1,9 1,12 1,13 1,18 1,26 1,27 1,28 1,30 1,32 1,36 1,37 1,43 1,44 1,47 1,49 1,50 1,53 1,71 1,72 1,79 1,90 1,99 1,103 4.222}
{0 CHEMBL2348924,1 1,2 1,3 1,4 1,5 1,6 1,7 1,8 1,9 1,12 1,13 1,18 1,32 1,34 1,36 1,37 1,42 1,43 1,44 1,57 1,72 1,73 1,79 1,84 1,88 1,92 1,103 4.222}
{0 CHEMBL2348925,1 1,2 1,3 1,4 1,5 1,6 1,7 1,8 1,9 1,12 1,13 1,18 1,32 1,36 1,42 1,43 1,44 1,50 1,57 1,59 1,73 1,74 1,78 1,79 1,81 1,84 1,88 1,89 1,90 1,92 1,103 4.222}
{0 CHEMBL2348926,1 1,2 1,3 1,4 1,5 1,6 1,7 1,8 1,9 1,12 1,13 1,18 1,32 1,36 1,42 1,43 1,44 1,47 1,50 1,57 1,59 1,72 1,73 1,79 1,84 1,88 1,90 1,92 1,98 1,103 4.222}
{0 CHEMBL2348927,1 1,2 1,3 1,4 1,5 1,6 1,7 1,8 1,9 1,12 1,13 1,18 1,32 1,36 1,42 1,43 1,44 1,50 1,57 1,59 1,73 1,74 1,78 1,79 1,84 1,88 1,90 1,92 1,103 4.222}
{0 CHEMBL2349027,1 1,2 1,3 1,4 1,5 1,6 1,7 1,8 1,9 1,12 1,13 1,18 1,32 1,36 1,42 1,43 1,44 1,50 1,57 1,59 1,73 1,74 1,76 1,78 1,79 1,84 1,88 1,90 1,92 1,103 4.222}
{0 CHEMBL2349028,1 1,2 1,3 1,4 1,5 1,6 1,7 1,8 1,9 1,12 1,13 1,18 1,32 1,36 1,42 1,43 1,44 1,50 1,57 1,59 1,73 1,74 1,78 1,79 1,84 1,88 1,90 1,92 1,103 4.222}
{0 CHEMBL2349029,1 1,2 1,3 1,4 1,5 1,6 1,7 1,8 1,9 1,12 1,13 1,18 1,32 1,36 1,42 1,43 1,44 1,50 1,57 1,59 1,73 1,74 1,78 1,79 1,84 1,88 1,90 1,92 1,103 4.222}
{0 CHEMBL2349030,1 1,2 1,3 1,4 1,5 1,6 1,7 1,8 1,9 1,12 1,13 1,18 1,32 1,36 1,42 1,43 1,44 1,50 1,52 1,54 1,57 1,59 1,72 1,73 1,74 1,79 1,84 1,88 1,90 1,92 1,103 4.222}
{0 CHEMBL2349031,1 1,2 1,3 1,4 1,5 1,6 1,7 1,8 1,9 1,12 1,13 1,18 1,32 1,36 1,42 1,43 1,44 1,47 1,50 1,54 1,57 1,59 1,73 1,74 1,79 1,81 1,84 1,86 1,88 1,90 1,92 1,94 1,98 1,103 4.222}
{0 CHEMBL2349032,1 1,2 1,3 1,4 1,5 1,6 1,7 1,8 1,9 1,12 1,13 1,18 1,32 1,36 1,42 1,43 1,44 1,47 1,54 1,57 1,59 1,73 1,74 1,79 1,81 1,84 1,86 1,88 1,90 1,92 1,94 1,98 1,103 4.222}
{0 CHEMBL2349033,1 1,2 1,3 1,4 1,5 1,6 1,7 1,8 1,9 1,12 1,13 1,18 1,32 1,36 1,42 1,43 1,44 1,47 1,50 1,54 1,57 1,59 1,73 1,74 1,79 1,81 1,84 1,86 1,88 1,90 1,92 1,94 1,103 4.222}
{0 CHEMBL2349034,1 1,2 1,3 1,4 1,5 1,6 1,7 1,8 1,9 1,12 1,13 1,18 1,32 1,36 1,42 1,43 1,44 1,47 1,54 1,57 1,59 1,73 1,74 1,79 1,81 1,84 1,86 1,88 1,90 1,92 1,94 1,98 1,103 4.222}
{0 CHEMBL2349035,1 1,2 1,3 1,4 1,5 1,6 1,7 1,8 1,9 1,12 1,13 1,18 1,32 1,36 1,42 1,43 1,44 1,47 1,54 1,57 1,59 1,73 1,74 1,79 1,81 1,84 1,86 1,88 1,90 1,92 1,94 1,98 1,103 4.222}
{0 CHEMBL2349036,1 1,2 1,3 1,4 1,5 1,6 1,7 1,8 1,9 1,12 1,13 1,18 1,32 1,33 1,36 1,42 1,43 1,44 1,52 1,54 1,57 1,59 1,72 1,73 1,74 1,79 1,84 1,88 1,90 1,92 1,103 4.222}
{0 CHEMBL2349037,1 1,2 1,3 1,4 1,5 1,6 1,7 1,8 1,9 1,12 1,13 1,18 1,32 1,34 1,36 1,42 1,43 1,44 1,48 1,52 1,54 1,57 1,59 1,72 1,73 1,74 1,79 1,84 1,88 1,90 1,92 1,103 4.222}
{0 CHEMBL2349038,1 1,2 1,3 1,4 1,5 1,6 1,7 1,8 1,9 1,12 1,13 1,18 1,32 1,36 1,42 1,43 1,44 1,47 1,50 1,57 1,59 1,73 1,79 1,81 1,84 1,88 1,90 1,92 1,103 4.222}
{0 CHEMBL2349039,1 1,2 1,3 1,4 1,5 1,6 1,7 1,8 1,9 1,12 1,13 1,18 1,32 1,36 1,42 1,43 1,44 1,50 1,57 1,59 1,73 1,74 1,78 1,79 1,84 1,88 1,90 1,92 1,103 4.222}
{0 CHEMBL2349040,1 1,2 1,3 1,4 1,5 1,6 1,7 1,8 1,9 1,12 1,13 1,18 1,32 1,36 1,42 1,43 1,44 1,47 1,49 1,50 1,57 1,59 1,73 1,79 1,84 1,88 1,90 1,92 1,103 4.222}
{0 CHEMBL2349041,1 1,2 1,3 1,4 1,5 1,6 1,7 1,8 1,9 1,12 1,13 1,18 1,32 1,34 1,36 1,37 1,42 1,43 1,44 1,48 1,52 1,72 1,73 1,79 1,80 1,84 1,88 1,92 1,103 4.222}
{0 CHEMBL2349042,1 1,2 1,3 1,4 1,5 1,6 1,7 1,8 1,9 1,12 1,13 1,18 1,32 1,34 1,36 1,42 1,43 1,44 1,48 1,50 1,52 1,67 1,72 1,73 1,78 1,79 1,80 1,81 1,84 1,85 1,88 1,89 1,90 1,92 1,103 4.222}
{0 CHEMBL2349043,1 1,2 1,3 1,4 1,5 1,6 1,7 1,8 1,9 1,12 1,13 1,18 1,21 1,32 1,34 1,36 1,42 1,43 1,44 1,47 1,48 1,50 1,52 1,67 1,72 1,73 1,79 1,80 1,84 1,88 1,90 1,92 1,98 1,103 4.222}
{0 CHEMBL2349044,1 1,2 1,3 1,4 1,5 1,6 1,7 1,8 1,9 1,12 1,13 1,18 1,32 1,34 1,36 1,42 1,43 1,44 1,48 1,50 1,52 1,57 1,67 1,72 1,73 1,78 1,79 1,80 1,84 1,85 1,88 1,90 1,92 1,103 4.222}
{0 CHEMBL2349045,1 1,2 1,3 1,4 1,5 1,6 1,7 1,8 1,9 1,12 1,13 1,18 1,32 1,34 1,36 1,42 1,43 1,44 1,48 1,50 1,52 1,57 1,67 1,72 1,73 1,76 1,78 1,79 1,80 1,84 1,85 1,88 1,90 1,92 1,103 4.222}
{0 CHEMBL2349046,1 1,2 1,3 1,4 1,5 1,6 1,7 1,8 1,9 1,12 1,13 1,18 1,32 1,34 1,36 1,42 1,43 1,44 1,48 1,50 1,52 1,57 1,67 1,72 1,73 1,78 1,79 1,80 1,84 1,85 1,88 1,90 1,92 1,103 4.222}
{0 CHEMBL2349047,1 1,2 1,3 1,4 1,5 1,6 1,7 1,8 1,9 1,12 1,13 1,18 1,32 1,34 1,36 1,42 1,43 1,44 1,48 1,50 1,52 1,67 1,72 1,73 1,78 1,79 1,80 1,84 1,85 1,88 1,90 1,92 1,103 4.222}
{0 CHEMBL2349048,1 1,2 1,3 1,4 1,5 1,6 1,7 1,8 1,9 1,12 1,13 1,18 1,32 1,34 1,36 1,42 1,43 1,44 1,48 1,50 1,52 1,54 1,67 1,72 1,73 1,79 1,80 1,84 1,85 1,88 1,90 1,92 1,103 4.222}
{0 CHEMBL2349049,1 1,2 1,3 1,4 1,5 1,6 1,7 1,8 1,9 1,12 1,13 1,18 1,32 1,34 1,36 1,42 1,43 1,44 1,48 1,49 1,52 1,67 1,72 1,73 1,79 1,80 1,84 1,85 1,88 1,90 1,92 1,100 1,103 4.222}
{0 CHEMBL2349050,1 1,2 1,3 1,4 1,5 1,6 1,7 1,8 1,9 1,12 1,13 1,18 1,32 1,34 1,36 1,42 1,43 1,44 1,47 1,48 1,50 1,52 1,54 1,67 1,72 1,73 1,79 1,80 1,81 1,84 1,85 1,86 1,88 1,90 1,92 1,94 1,98 1,103 4.222}
{0 CHEMBL2349051,1 1,2 1,3 1,4 1,5 1,6 1,7 1,8 1,9 1,12 1,13 1,18 1,32 1,34 1,36 1,42 1,43 1,44 1,47 1,48 1,52 1,54 1,67 1,72 1,73 1,79 1,80 1,81 1,84 1,85 1,86 1,88 1,90 1,92 1,94 1,98 1,103 4.222}
{0 CHEMBL2349052,1 1,2 1,3 1,4 1,5 1,6 1,7 1,8 1,9 1,12 1,13 1,18 1,32 1,34 1,36 1,42 1,43 1,44 1,47 1,48 1,50 1,52 1,54 1,67 1,72 1,73 1,79 1,80 1,81 1,84 1,85 1,86 1,88 1,90 1,92 1,94 1,103 4.222}
{0 CHEMBL2349053,1 1,2 1,3 1,4 1,5 1,6 1,7 1,8 1,9 1,12 1,13 1,18 1,32 1,34 1,36 1,42 1,43 1,44 1,47 1,48 1,52 1,54 1,67 1,72 1,73 1,79 1,80 1,81 1,84 1,85 1,86 1,88 1,90 1,92 1,94 1,98 1,103 4.222}
{0 CHEMBL2349054,1 1,2 1,3 1,4 1,5 1,6 1,7 1,8 1,9 1,12 1,13 1,18 1,32 1,33 1,34 1,36 1,42 1,43 1,44 1,48 1,52 1,54 1,67 1,72 1,73 1,79 1,80 1,84 1,85 1,88 1,90 1,92 1,103 4.222}
{0 CHEMBL2349055,1 1,2 1,3 1,4 1,5 1,6 1,7 1,8 1,9 1,12 1,13 1,18 1,32 1,34 1,36 1,42 1,43 1,44 1,48 1,52 1,54 1,67 1,72 1,73 1,79 1,80 1,84 1,85 1,88 1,90 1,92 1,103 4.222}
{0 CHEMBL2349056,1 1,2 1,3 1,4 1,5 1,6 1,7 1,8 1,9 1,12 1,13 1,18 1,21 1,32 1,34 1,36 1,42 1,43 1,44 1,47 1,48 1,50 1,52 1,67 1,72 1,73 1,79 1,80 1,81 1,84 1,88 1,90 1,92 1,103 4.222}
{0 CHEMBL2349057,1 1,2 1,3 1,4 1,5 1,6 1,7 1,8 1,9 1,12 1,13 1,18 1,32 1,34 1,36 1,42 1,43 1,44 1,48 1,50 1,52 1,67 1,72 1,73 1,78 1,79 1,80 1,84 1,85 1,88 1,90 1,92 1,103 4.222}
{0 CHEMBL2349058,1 1,2 1,3 1,4 1,5 1,6 1,7 1,8 1,9 1,12 1,13 1,18 1,21 1,32 1,34 1,36 1,42 1,43 1,44 1,47 1,48 1,49 1,50 1,52 1,67 1,72 1,73 1,79 1,80 1,84 1,88 1,90 1,92 1,103 4.222}
{0 CHEMBL239117,10 1,11 1,12 1,13 1,14 1,15 1,16 1,17 1,18 1,19 1,20 1,21 1,22 1,23 1,24 1,25 1,29 1,31 1,32 1,33 1,34 1,35 1,47 1,50 1,58 1,61 1,62 1,72 1,79 1,84 1,103 7.201}
{0 CHEMBL239332,10 1,11 1,14 1,15 1,16 1,17 1,19 1,20 1,21 1,22 1,23 1,24 1,25 1,29 1,31 1,33 1,34 1,35 1,47 1,58 1,61 1,62 1,72 1,79 1,84 1,103 7.328}
{0 CHEMBL239748,10 1,11 1,14 1,15 1,16 1,17 1,19 1,20 1,21 1,22 1,23 1,24 1,25 1,29 1,31 1,33 1,34 1,35 1,47 1,58 1,61 1,62 1,72 1,79 1,84 1,103 7.071}
{0 CHEMBL261197,10 1,11 1,14 1,15 1,16 1,17 1,19 1,20 1,21 1,22 1,23 1,24 1,25 1,29 1,33 1,34 1,39 1,40 1,46 1,47 1,49 1,62 1,72 1,79 1,90 1,103 6.611}
{0 CHEMBL263638,10 1,11 1,14 1,15 1,16 1,17 1,19 1,20 1,21 1,22 1,23 1,24 1,25 1,29 1,33 1,34 1,39 1,40 1,46 1,47 1,49 1,62 1,72 1,79 1,90 1,103 6.523}
{0 CHEMBL272304,10 1,12 1,13 1,18 1,29 1,32 1,34 1,47 1,72 1,79 1,84 1,99 1,103 8.406}
{0 CHEMBL272502,10 1,12 1,13 1,18 1,29 1,32 1,34 1,47 1,72 1,79 1,84 1,99 1,103 6.881}
{0 CHEMBL299680,10 1,11 1,16 1,17 1,19 1,20 1,21 1,22 1,23 1,25 1,29 1,31 1,33 1,34 1,35 1,39 1,47 1,58 1,61 1,62 1,72 1,73 1,79 1,80 1,103 9.745}
{0 CHEMBL318267,10 1,11 1,12 1,13 1,14 1,15 1,16 1,17 1,18 1,19 1,20 1,21 1,22 1,23 1,24 1,25 1,29 1,31 1,32 1,33 1,34 1,35 1,47 1,58 1,61 1,62 1,72 1,79 1,84 1,103 10.137}
{0 CHEMBL318617,10 1,11 1,12 1,13 1,14 1,15 1,16 1,17 1,18 1,19 1,20 1,21 1,22 1,23 1,24 1,25 1,29 1,31 1,32 1,33 1,34 1,35 1,47 1,58 1,61 1,62 1,72 1,79 1,84 1,103 10.051}
{0 CHEMBL375811,10 1,11 1,14 1,15 1,16 1,17 1,19 1,20 1,21 1,22 1,23 1,24 1,25 1,29 1,31 1,33 1,34 1,35 1,47 1,58 1,61 1,62 1,72 1,79 1,100 1,103 9.699}
{0 CHEMBL376093,10 1,11 1,14 1,15 1,16 1,17 1,19 1,20 1,21 1,23 1,24 1,25 1,29 1,31 1,33 1,34 1,47 1,49 1,58 1,72 1,77 1,79 1,84 1,103 7.71}
{0 CHEMBL380811,10 1,11 1,14 1,15 1,16 1,17 1,19 1,20 1,21 1,22 1,23 1,24 1,25 1,29 1,33 1,34 1,39 1,40 1,46 1,47 1,49 1,62 1,72 1,79 1,90 1,103 6.523}
{0 CHEMBL381178,10 1,11 1,12 1,13 1,14 1,15 1,16 1,17 1,18 1,19 1,20 1,21 1,22 1,23 1,24 1,25 1,29 1,31 1,32 1,33 1,34 1,35 1,39 1,42 1,46 1,47 1,49 1,50 1,58 1,60 1,61 1,62 1,70 1,72 1,78 1,79 1,82 1,90 1,103 6.155}
{0 CHEMBL383014,10 1,11 1,12 1,13 1,14 1,15 1,16 1,17 1,18 1,19 1,20 1,21 1,22 1,23 1,24 1,25 1,29 1,31 1,32 1,33 1,34 1,35 1,36 1,39 1,42 1,46 1,47 1,49 1,50 1,52 1,58 1,60 1,61 1,62 1,70 1,72 1,79 1,82 1,84 1,90 1,103 5.658}
{0 CHEMBL383450,10 1,11 1,14 1,15 1,16 1,17 1,19 1,20 1,21 1,22 1,23 1,24 1,25 1,29 1,31 1,33 1,34 1,35 1,39 1,42 1,46 1,47 1,49 1,58 1,60 1,61 1,62 1,70 1,72 1,79 1,82 1,90 1,100 1,103 6}
{0 CHEMBL383850,10 1,11 1,14 1,15 1,16 1,17 1,19 1,20 1,21 1,22 1,23 1,24 1,25 1,29 1,31 1,33 1,34 1,35 1,38 1,39 1,40 1,41 1,45 1,46 1,47 1,49 1,58 1,61 1,62 1,72 1,79 1,90 1,100 1,103 8.222}
{0 CHEMBL383856,10 1,11 1,14 1,15 1,16 1,17 1,19 1,20 1,21 1,22 1,23 1,24 1,25 1,29 1,31 1,33 1,34 1,35 1,38 1,39 1,40 1,41 1,45 1,46 1,47 1,49 1,58 1,61 1,62 1,72 1,79 1,90 1,100 1,103 8.086}
{0 CHEMBL383902,10 1,11 1,14 1,15 1,16 1,17 1,19 1,20 1,21 1,22 1,23 1,24 1,25 1,29 1,31 1,33 1,34 1,35 1,39 1,40 1,46 1,47 1,49 1,58 1,61 1,62 1,72 1,79 1,90 1,103 8.201}
{0 CHEMBL383910,10 1,11 1,14 1,15 1,16 1,17 1,19 1,20 1,21 1,22 1,23 1,24 1,25 1,29 1,31 1,33 1,34 1,35 1,38 1,39 1,40 1,41 1,45 1,46 1,47 1,49 1,58 1,61 1,62 1,72 1,79 1,90 1,100 1,103 8.222}
{0 CHEMBL384015,10 1,11 1,14 1,15 1,16 1,17 1,19 1,20 1,21 1,22 1,23 1,24 1,25 1,29 1,31 1,33 1,34 1,35 1,38 1,39 1,40 1,41 1,44 1,45 1,46 1,47 1,49 1,72 1,79 1,84 1,87 1,90 1,99 1,103 8.032}
{0 CHEMBL384020,10 1,11 1,14 1,15 1,16 1,17 1,19 1,20 1,21 1,22 1,23 1,24 1,25 1,29 1,31 1,33 1,34 1,35 1,38 1,39 1,40 1,41 1,46 1,47 1,49 1,63 1,72 1,76 1,79 1,90 1,97 1,103 8.167}
{0 CHEMBL384055,10 1,11 1,14 1,15 1,16 1,17 1,19 1,20 1,21 1,22 1,23 1,24 1,25 1,29 1,31 1,33 1,34 1,35 1,38 1,39 1,40 1,41 1,44 1,45 1,46 1,47 1,49 1,72 1,79 1,84 1,87 1,90 1,99 1,103 8.032}
{0 CHEMBL384167,10 1,11 1,14 1,15 1,16 1,17 1,19 1,20 1,21 1,22 1,23 1,24 1,25 1,29 1,31 1,33 1,34 1,35 1,38 1,39 1,40 1,41 1,43 1,44 1,45 1,46 1,47 1,49 1,63 1,72 1,76 1,79 1,90 1,99 1,103 8.076}
{0 CHEMBL384370,10 1,11 1,14 1,15 1,16 1,17 1,19 1,20 1,21 1,22 1,23 1,24 1,25 1,29 1,31 1,33 1,34 1,35 1,38 1,39 1,40 1,41 1,43 1,44 1,45 1,46 1,47 1,49 1,63 1,72 1,76 1,79 1,90 1,99 1,100 1,103 8.201}
{0 CHEMBL384538,10 1,11 1,14 1,15 1,16 1,17 1,19 1,20 1,21 1,22 1,23 1,24 1,25 1,29 1,31 1,33 1,34 1,35 1,38 1,39 1,40 1,41 1,45 1,46 1,47 1,49 1,63 1,72 1,76 1,79 1,90 1,100 1,103 8.174}
{0 CHEMBL384614,10 1,11 1,14 1,15 1,16 1,17 1,19 1,20 1,21 1,22 1,23 1,24 1,25 1,29 1,31 1,33 1,34 1,35 1,38 1,39 1,40 1,41 1,45 1,46 1,47 1,49 1,58 1,61 1,62 1,72 1,79 1,90 1,100 1,103 8.222}
{0 CHEMBL384929,10 1,11 1,14 1,15 1,16 1,17 1,19 1,20 1,21 1,22 1,23 1,24 1,25 1,29 1,31 1,33 1,34 1,35 1,38 1,39 1,40 1,41 1,45 1,46 1,47 1,49 1,63 1,72 1,76 1,79 1,90 1,100 1,103 8.201}
{0 CHEMBL385001,10 1,11 1,14 1,15 1,16 1,17 1,19 1,20 1,21 1,22 1,23 1,24 1,25 1,29 1,31 1,33 1,34 1,35 1,38 1,39 1,40 1,41 1,44 1,45 1,46 1,47 1,49 1,72 1,79 1,84 1,90 1,99 1,100 1,103 8.056}
{0 CHEMBL385205,10 1,11 1,14 1,15 1,16 1,17 1,19 1,20 1,21 1,22 1,23 1,24 1,25 1,29 1,31 1,33 1,34 1,35 1,38 1,39 1,40 1,41 1,44 1,46 1,47 1,49 1,72 1,79 1,84 1,90 1,97 1,99 1,103 8.215}
{0 CHEMBL385265,10 1,11 1,14 1,15 1,16 1,17 1,19 1,20 1,21 1,22 1,23 1,24 1,25 1,29 1,31 1,33 1,34 1,35 1,38 1,39 1,40 1,41 1,43 1,44 1,45 1,46 1,47 1,49 1,63 1,72 1,76 1,79 1,87 1,90 1,99 1,103 8.032}
{0 CHEMBL385342,10 1,11 1,14 1,15 1,16 1,17 1,19 1,20 1,21 1,22 1,23 1,24 1,25 1,29 1,31 1,33 1,34 1,35 1,38 1,39 1,40 1,41 1,43 1,44 1,45 1,46 1,47 1,49 1,63 1,72 1,76 1,79 1,90 1,99 1,100 1,103 8.201}
{0 CHEMBL385705,10 1,11 1,14 1,15 1,16 1,17 1,19 1,20 1,21 1,22 1,23 1,24 1,25 1,29 1,31 1,33 1,34 1,35 1,38 1,39 1,40 1,41 1,44 1,46 1,47 1,49 1,72 1,79 1,84 1,90 1,97 1,99 1,103 8.215}
{0 CHEMBL385707,10 1,11 1,14 1,15 1,16 1,17 1,19 1,20 1,21 1,22 1,23 1,24 1,25 1,29 1,31 1,33 1,34 1,35 1,38 1,39 1,40 1,41 1,43 1,44 1,46 1,47 1,49 1,63 1,72 1,76 1,79 1,90 1,97 1,99 1,103 8.208}
{0 CHEMBL385765,10 1,11 1,14 1,15 1,16 1,17 1,19 1,20 1,21 1,22 1,23 1,24 1,25 1,29 1,31 1,33 1,34 1,35 1,38 1,39 1,40 1,41 1,45 1,46 1,47 1,49 1,58 1,61 1,62 1,72 1,79 1,90 1,103 8.066}
{0 CHEMBL385830,10 1,11 1,14 1,15 1,16 1,17 1,19 1,20 1,21 1,22 1,23 1,24 1,25 1,29 1,31 1,33 1,34 1,35 1,38 1,39 1,40 1,41 1,43 1,44 1,45 1,46 1,47 1,49 1,63 1,72 1,76 1,79 1,90 1,99 1,103 8.076}
{0 CHEMBL385833,10 1,11 1,14 1,15 1,16 1,17 1,19 1,20 1,21 1,22 1,23 1,24 1,25 1,29 1,31 1,33 1,34 1,35 1,38 1,39 1,40 1,41 1,43 1,44 1,45 1,46 1,47 1,49 1,63 1,72 1,76 1,79 1,90 1,99 1,100 1,103 8.056}
{0 CHEMBL385871,10 1,11 1,14 1,15 1,16 1,17 1,19 1,20 1,21 1,22 1,23 1,24 1,25 1,29 1,31 1,33 1,34 1,35 1,38 1,39 1,40 1,41 1,44 1,45 1,46 1,47 1,49 1,72 1,79 1,84 1,90 1,99 1,103 8.076}
{0 CHEMBL385926,10 1,11 1,14 1,15 1,16 1,17 1,19 1,20 1,21 1,22 1,23 1,24 1,25 1,29 1,31 1,33 1,34 1,35 1,38 1,39 1,40 1,41 1,45 1,46 1,47 1,49 1,63 1,72 1,76 1,79 1,90 1,100 1,103 8.201}
{0 CHEMBL386412,10 1,11 1,14 1,15 1,16 1,17 1,19 1,20 1,21 1,22 1,23 1,24 1,25 1,29 1,31 1,33 1,34 1,35 1,39 1,40 1,46 1,47 1,49 1,58 1,61 1,62 1,72 1,79 1,90 1,103 8.222}
{0 CHEMBL386623,10 1,11 1,14 1,15 1,16 1,17 1,19 1,20 1,21 1,22 1,23 1,24 1,25 1,29 1,31 1,33 1,34 1,35 1,38 1,39 1,40 1,41 1,45 1,46 1,47 1,49 1,63 1,72 1,76 1,79 1,90 1,100 1,103 8.174}
{0 CHEMBL387098,10 1,11 1,14 1,15 1,16 1,17 1,19 1,20 1,21 1,22 1,23 1,24 1,25 1,29 1,31 1,33 1,34 1,35 1,39 1,40 1,46 1,47 1,49 1,58 1,61 1,62 1,72 1,79 1,90 1,94 1,103 8.222}
{0 CHEMBL387220,10 1,11 1,14 1,15 1,16 1,17 1,19 1,20 1,21 1,22 1,23 1,24 1,25 1,29 1,31 1,33 1,34 1,35 1,38 1,39 1,40 1,41 1,44 1,46 1,47 1,49 1,72 1,79 1,84 1,90 1,97 1,99 1,103 8.215}
{0 CHEMBL387281,10 1,11 1,14 1,15 1,16 1,17 1,19 1,20 1,21 1,22 1,23 1,24 1,25 1,29 1,31 1,33 1,34 1,35 1,38 1,39 1,40 1,41 1,44 1,45 1,46 1,47 1,49 1,72 1,79 1,84 1,90 1,99 1,100 1,103 8.201}
{0 CHEMBL387286,10 1,11 1,14 1,15 1,16 1,17 1,19 1,20 1,21 1,22 1,23 1,24 1,25 1,29 1,31 1,33 1,34 1,35 1,38 1,39 1,40 1,41 1,45 1,46 1,47 1,49 1,58 1,61 1,62 1,72 1,79 1,90 1,100 1,103 8.086}
{0 CHEMBL387473,10 1,11 1,14 1,15 1,16 1,17 1,19 1,20 1,21 1,22 1,23 1,24 1,25 1,29 1,31 1,33 1,34 1,35 1,38 1,39 1,40 1,41 1,46 1,47 1,49 1,58 1,61 1,62 1,72 1,79 1,90 1,97 1,103 7.959}
{0 CHEMBL388138,10 1,11 1,14 1,15 1,16 1,17 1,19 1,20 1,21 1,22 1,23 1,24 1,29 1,33 1,34 1,39 1,47 1,62 1,72 1,79 1,103 8.959}
{0 CHEMBL393978,10 1,11 1,14 1,15 1,16 1,17 1,19 1,20 1,21 1,22 1,23 1,24 1,25 1,29 1,31 1,33 1,34 1,35 1,47 1,58 1,61 1,62 1,72 1,79 1,84 1,103 6.703}
{0 CHEMBL403670,10 1,12 1,13 1,18 1,29 1,32 1,34 1,47 1,72 1,79 1,84 1,99 1,103 7.656}
{0 CHEMBL403885,10 1,12 1,13 1,18 1,29 1,32 1,34 1,47 1,72 1,79 1,84 1,99 1,103 7.676}
{0 CHEMBL409470,10 1,11 1,14 1,15 1,16 1,17 1,19 1,20 1,21 1,22 1,23 1,24 1,25 1,29 1,33 1,34 1,39 1,40 1,46 1,47 1,49 1,62 1,72 1,79 1,90 1,103 7.412}
{0 CHEMBL410320,10 1,11 1,14 1,15 1,16 1,17 1,19 1,20 1,21 1,22 1,23 1,24 1,25 1,29 1,31 1,33 1,34 1,35 1,38 1,39 1,40 1,41 1,46 1,47 1,49 1,58 1,61 1,62 1,72 1,79 1,90 1,97 1,103 8.114}
{0 CHEMBL425097,10 1,11 1,14 1,15 1,16 1,17 1,19 1,20 1,21 1,22 1,23 1,24 1,25 1,29 1,31 1,33 1,34 1,35 1,38 1,39 1,40 1,41 1,45 1,46 1,47 1,49 1,58 1,61 1,62 1,72 1,79 1,87 1,90 1,103 8.022}
{0 CHEMBL426664,10 1,11 1,12 1,13 1,14 1,15 1,16 1,17 1,18 1,19 1,20 1,21 1,22 1,23 1,24 1,25 1,29 1,31 1,32 1,33 1,34 1,35 1,36 1,39 1,42 1,46 1,47 1,49 1,50 1,52 1,58 1,60 1,61 1,62 1,70 1,72 1,79 1,82 1,84 1,90 1,99 1,103 6.409}
{0 CHEMBL428384,10 1,11 1,14 1,15 1,16 1,17 1,19 1,20 1,21 1,22 1,23 1,24 1,25 1,29 1,31 1,33 1,34 1,35 1,41 1,47 1,58 1,61 1,62 1,69 1,72 1,79 1,84 1,103 6.523}
{0 CHEMBL429347,10 1,11 1,14 1,15 1,16 1,17 1,19 1,20 1,21 1,22 1,23 1,24 1,25 1,29 1,33 1,34 1,39 1,40 1,46 1,47 1,49 1,62 1,72 1,79 1,90 1,103 6.523}
{0 CHEMBL442812,10 1,11 1,12 1,13 1,14 1,15 1,16 1,17 1,18 1,19 1,20 1,21 1,22 1,23 1,24 1,25 1,29 1,31 1,33 1,34 1,35 1,36 1,39 1,42 1,46 1,47 1,49 1,57 1,58 1,60 1,61 1,62 1,70 1,72 1,79 1,81 1,82 1,84 1,89 1,90 1,103 6.066}
{0 CHEMBL443390,10 1,11 1,12 1,13 1,14 1,15 1,16 1,17 1,18 1,19 1,20 1,21 1,22 1,23 1,24 1,25 1,29 1,31 1,33 1,34 1,35 1,39 1,42 1,46 1,47 1,49 1,58 1,60 1,61 1,62 1,70 1,72 1,78 1,79 1,82 1,84 1,89 1,90 1,103 7.046}
{0 CHEMBL449281,10 1,11 1,12 1,13 1,14 1,15 1,16 1,17 1,18 1,19 1,20 1,21 1,22 1,23 1,24 1,25 1,29 1,31 1,33 1,34 1,35 1,39 1,42 1,46 1,47 1,49 1,58 1,60 1,61 1,62 1,70 1,72 1,78 1,79 1,82 1,84 1,89 1,90 1,103 6.745}
{0 CHEMBL449990,10 1,11 1,12 1,13 1,14 1,15 1,16 1,17 1,18 1,19 1,20 1,21 1,22 1,23 1,24 1,25 1,29 1,31 1,32 1,33 1,34 1,35 1,39 1,42 1,46 1,47 1,49 1,50 1,58 1,60 1,61 1,62 1,70 1,72 1,78 1,79 1,82 1,90 1,103 6.155}
{0 CHEMBL450080,10 1,11 1,12 1,13 1,14 1,15 1,16 1,17 1,18 1,19 1,20 1,21 1,22 1,23 1,24 1,25 1,29 1,31 1,32 1,33 1,34 1,35 1,36 1,39 1,42 1,46 1,47 1,49 1,50 1,58 1,60 1,61 1,62 1,70 1,72 1,79 1,81 1,82 1,84 1,90 1,103 6.712}
{0 CHEMBL452878,10 1,11 1,14 1,15 1,16 1,17 1,19 1,20 1,21 1,22 1,23 1,24 1,25 1,29 1,33 1,34 1,36 1,47 1,58 1,62 1,72 1,79 1,103 7.572}
{0 CHEMBL452939,10 1,11 1,12 1,13 1,14 1,15 1,16 1,17 1,18 1,19 1,20 1,21 1,22 1,23 1,24 1,25 1,29 1,31 1,33 1,34 1,35 1,39 1,42 1,46 1,47 1,49 1,58 1,60 1,61 1,62 1,70 1,72 1,78 1,79 1,82 1,84 1,89 1,90 1,100 1,103 6.268}
{0 CHEMBL454074,10 1,11 1,12 1,13 1,14 1,15 1,16 1,17 1,18 1,19 1,20 1,21 1,22 1,23 1,24 1,25 1,29 1,31 1,33 1,34 1,35 1,39 1,42 1,46 1,47 1,49 1,57 1,58 1,60 1,61 1,62 1,70 1,72 1,78 1,79 1,82 1,89 1,90 1,103 5.523}
{0 CHEMBL460967,10 1,11 1,12 1,13 1,14 1,15 1,16 1,17 1,18 1,19 1,20 1,21 1,22 1,23 1,24 1,25 1,29 1,31 1,32 1,33 1,34 1,35 1,36 1,39 1,42 1,46 1,47 1,49 1,50 1,52 1,58 1,60 1,61 1,62 1,70 1,72 1,79 1,82 1,84 1,90 1,103 5.658}
{0 CHEMBL466792,10 1,11 1,14 1,15 1,16 1,17 1,19 1,20 1,21 1,22 1,23 1,24 1,25 1,29 1,33 1,34 1,36 1,47 1,62 1,72 1,79 1,89 1,103 8.523}
{0 CHEMBL467212,10 1,11 1,14 1,15 1,16 1,17 1,19 1,20 1,21 1,22 1,23 1,24 1,25 1,29 1,33 1,34 1,36 1,47 1,62 1,72 1,79 1,103 10.699}
{0 CHEMBL467664,10 1,11 1,12 1,13 1,14 1,15 1,16 1,17 1,18 1,19 1,20 1,21 1,22 1,23 1,24 1,25 1,29 1,31 1,33 1,34 1,35 1,39 1,42 1,46 1,47 1,49 1,57 1,58 1,60 1,61 1,62 1,70 1,72 1,78 1,79 1,82 1,89 1,90 1,103 5.523}
{0 CHEMBL472857,10 1,11 1,12 1,13 1,14 1,15 1,16 1,17 1,18 1,19 1,20 1,21 1,22 1,23 1,24 1,25 1,29 1,31 1,33 1,34 1,35 1,39 1,42 1,46 1,47 1,49 1,57 1,58 1,60 1,61 1,62 1,70 1,72 1,78 1,79 1,82 1,89 1,90 1,103 6.523}
{0 CHEMBL492749,10 1,11 1,14 1,15 1,16 1,17 1,20 1,21 1,23 1,25 1,29 1,31 1,33 1,34 1,35 1,47 1,58 1,61 1,62 1,72 1,79 1,103 9.161}
{0 CHEMBL494338,10 1,11 1,14 1,15 1,16 1,17 1,20 1,21 1,23 1,25 1,29 1,31 1,33 1,34 1,35 1,47 1,58 1,61 1,62 1,72 1,79 1,103 9.167}
{0 CHEMBL499517,10 1,11 1,12 1,13 1,14 1,15 1,16 1,17 1,18 1,19 1,20 1,21 1,22 1,23 1,24 1,25 1,29 1,31 1,33 1,34 1,35 1,36 1,39 1,42 1,46 1,47 1,49 1,52 1,57 1,58 1,60 1,61 1,62 1,70 1,72 1,79 1,82 1,84 1,89 1,90 1,103 6.108}
{0 CHEMBL502038,10 1,11 1,12 1,13 1,14 1,15 1,16 1,17 1,18 1,19 1,20 1,21 1,22 1,23 1,24 1,25 1,29 1,31 1,33 1,34 1,35 1,39 1,42 1,46 1,47 1,49 1,57 1,58 1,60 1,61 1,62 1,70 1,72 1,78 1,79 1,82 1,89 1,90 1,103 5.523}
{0 CHEMBL509677,10 1,11 1,12 1,13 1,14 1,15 1,16 1,17 1,18 1,19 1,20 1,21 1,22 1,23 1,24 1,25 1,29 1,31 1,32 1,33 1,34 1,35 1,36 1,39 1,42 1,46 1,47 1,49 1,50 1,52 1,58 1,60 1,61 1,62 1,70 1,72 1,79 1,82 1,84 1,90 1,99 1,103 6.409}
{0 CHEMBL846,10 1,11 1,14 1,15 1,16 1,17 1,19 1,20 1,21 1,22 1,23 1,24 1,25 1,29 1,31 1,33 1,34 1,35 1,39 1,47 1,58 1,61 1,62 1,72 1,79 1,103 8.484}
