"molecule_id","FCFP4_1024b1","FCFP4_1024b10","FCFP4_1024b100","FCFP4_1024b1000","FCFP4_1024b1001","FCFP4_1024b1002","FCFP4_1024b1003","FCFP4_1024b1004","FCFP4_1024b1005","FCFP4_1024b1006","FCFP4_1024b1007","FCFP4_1024b1008","FCFP4_1024b1009","FCFP4_1024b101","FCFP4_1024b1010","FCFP4_1024b1011","FCFP4_1024b1012","FCFP4_1024b1013","FCFP4_1024b1014","FCFP4_1024b1015","FCFP4_1024b1016","FCFP4_1024b1017","FCFP4_1024b1018","FCFP4_1024b1019","FCFP4_1024b102","FCFP4_1024b1020","FCFP4_1024b1021","FCFP4_1024b1022","FCFP4_1024b1023","FCFP4_1024b1024","FCFP4_1024b103","FCFP4_1024b104","FCFP4_1024b105","FCFP4_1024b106","FCFP4_1024b107","FCFP4_1024b108","FCFP4_1024b109","FCFP4_1024b11","FCFP4_1024b110","FCFP4_1024b111","FCFP4_1024b112","FCFP4_1024b113","FCFP4_1024b114","FCFP4_1024b115","FCFP4_1024b116","FCFP4_1024b117","FCFP4_1024b118","FCFP4_1024b119","FCFP4_1024b12","FCFP4_1024b120","FCFP4_1024b121","pXC50"
{1 1,26 1,52 9.31}
{0 CHEMBL294262,1 1,35 1,52 6.167}
{0 CHEMBL294263,1 1,35 1,52 9.523}
{0 CHEMBL304191,1 1,35 1,52 7.187}
{0 CHEMBL405854,1 1,26 1,44 1,52 10.229}
{0 CHEMBL411542,1 1,26 1,52 10}
{0 CHEMBL412793,1 1,26 1,52 6.444}
{0 CHEMBL412913,1 1,26 1,44 1,52 9.602}
{0 CHEMBL414293,1 1,26 1,44 1,52 8.785}
{0 CHEMBL415133,1 1,26 1,52 7.06}
{0 CHEMBL434023,1 1,35 1,52 5.585}
{0 CHEMBL435181,1 1,52 6.268}
{0 CHEMBL58588,1 1,35 1,52 9.319}
{0 CHEMBL59028,1 1,35 1,52 7.208}
{0 CHEMBL61383,1 1,35 1,52 9.398}
{0 CHEMBL61413,1 1,42 1,52 5.538}
