{
  "data_set_description": {
    "collection_date": "November 2013",
    "creator": "Dr Jeremy Besnard, Dr Ivan Olier, Dr Noureddin Sadawi, Dr Larisa Soldatova, Dr Crina Grosan, Prof Ross King, Dr Richard Bickerton, Prof Andrew Hopkins and Dr Willem van Hoorn",
    "default_target_attribute": "pXC50",
    "description": "This dataset contains QSAR data (from ChEMBL version 17) showing activity values (unit is pseudo-pCI50) of several compounds on drug target ChEMBL_ID: CHEMBL4108 (TID: 17110), and it has 36 rows and 1164 features (not including molecule IDs and class feature: molecule_id and pXC50). The features represent Molecular Descriptors which were generated from SMILES strings. Missing value imputation was applied to this dataset (By choosing the Median).",
    "description_version": "1",
    "file_id": "3601250",
    "format": "ARFF",
    "id": "36955",
    "licence": "Public",
    "md5_checksum": "711b2dcf585f3c56a4e965ce011ee503",
    "minio_url": "https://data.openml.org/datasets/0003/36955/dataset_36955.pq",
    "name": "QSAR-DATASET-FOR-DRUG-TARGET-CHEMBL4108",
    "original_data_url": "https://www.ebi.ac.uk/chembl/target/inspect/CHEMBL4108",
    "parquet_url": "https://data.openml.org/datasets/0003/36955/dataset_36955.pq",
    "processing_date": "2018-10-04 05:03:07",
    "row_id_attribute": "molecule_id",
    "status": "deactivated",
    "tag": [
      "MetaQSAR",
      "study_13"
    ],
    "upload_date": "2016-07-15T23:00:12",
    "url": "https://api.openml.org/data/v1/download/3601250/QSAR-DATASET-FOR-DRUG-TARGET-CHEMBL4108.arff",
    "version": "10",
    "visibility": "public"
  }
}