{
  "data_features": {
    "feature": [
      {
        "data_type": "nominal",
        "index": "0",
        "is_ignore": "false",
        "is_row_identifier": "true",
        "is_target": "false",
        "name": "molecule_id",
        "nominal_value": [
          "CHEMBL10024",
          "CHEMBL10044",
          "CHEMBL10045",
          "CHEMBL10058",
          "CHEMBL10074",
          "CHEMBL10241",
          "CHEMBL10261",
          "CHEMBL10404",
          "CHEMBL10439",
          "CHEMBL10442",
          "CHEMBL10470",
          "CHEMBL10564",
          "CHEMBL10740",
          "CHEMBL10742",
          "CHEMBL1081186",
          "CHEMBL10829",
          "CHEMBL1083400",
          "CHEMBL1083445",
          "CHEMBL10836",
          "CHEMBL1084009",
          "CHEMBL1084551",
          "CHEMBL1084552",
          "CHEMBL1084553",
          "CHEMBL1085040",
          "CHEMBL1085041",
          "CHEMBL1085081",
          "CHEMBL10853",
          "CHEMBL10856",
          "CHEMBL1086490",
          "CHEMBL1093125",
          "CHEMBL1093791",
          "CHEMBL1093792",
          "CHEMBL11088",
          "CHEMBL11211",
          "CHEMBL11291",
          "CHEMBL11394",
          "CHEMBL11480",
          "CHEMBL11571",
          "CHEMBL116836",
          "CHEMBL116837",
          "CHEMBL117038",
          "CHEMBL117399",
          "CHEMBL11746",
          "CHEMBL11765",
          "CHEMBL118567",
          "CHEMBL119397",
          "CHEMBL119550",
          "CHEMBL119809",
          "CHEMBL119810",
          "CHEMBL125588",
          "CHEMBL128747",
          "CHEMBL1290413",
          "CHEMBL129374",
          "CHEMBL129568",
          "CHEMBL132589",
          "CHEMBL132649",
          "CHEMBL134546",
          "CHEMBL14286",
          "CHEMBL14334",
          "CHEMBL14359",
          "CHEMBL14439",
          "CHEMBL14530",
          "CHEMBL14600",
          "CHEMBL14655",
          "CHEMBL15096",
          "CHEMBL1628635",
          "CHEMBL1644003",
          "CHEMBL165010",
          "CHEMBL166351",
          "CHEMBL1668898",
          "CHEMBL172250",
          "CHEMBL173299",
          "CHEMBL173499",
          "CHEMBL173680",
          "CHEMBL173811",
          "CHEMBL176692",
          "CHEMBL1794823",
          "CHEMBL1813115",
          "CHEMBL1813116",
          "CHEMBL1813117",
          "CHEMBL1813118",
          "CHEMBL1813119",
          "CHEMBL1813120",
          "CHEMBL1813121",
          "CHEMBL1813122",
          "CHEMBL1813123",
          "CHEMBL1813124",
          "CHEMBL1813125",
          "CHEMBL1813272",
          "CHEMBL1813273",
          "CHEMBL1813274",
          "CHEMBL1813275",
          "CHEMBL1813276",
          "CHEMBL1813277",
          "CHEMBL1813278",
          "CHEMBL1813279",
          "CHEMBL1813280",
          "CHEMBL1813281",
          "CHEMBL1813282",
          "CHEMBL1813283",
          "CHEMBL1813284",
          "CHEMBL1813285",
          "CHEMBL1813286",
          "CHEMBL1813287",
          "CHEMBL1813288",
          "CHEMBL1813289",
          "CHEMBL1819603",
          "CHEMBL1819604",
          "CHEMBL1819605",
          "CHEMBL1819606",
          "CHEMBL1819607",
          "CHEMBL1819608",
          "CHEMBL1819609",
          "CHEMBL1819611",
          "CHEMBL1819612",
          "CHEMBL1819614",
          "CHEMBL1819615",
          "CHEMBL1819619",
          "CHEMBL1819622",
          "CHEMBL1819623",
          "CHEMBL187544",
          "CHEMBL187758",
          "CHEMBL188384",
          "CHEMBL188758",
          "CHEMBL189063",
          "CHEMBL189378",
          "CHEMBL189694",
          "CHEMBL190236",
          "CHEMBL190288",
          "CHEMBL190497",
          "CHEMBL190708",
          "CHEMBL190735",
          "CHEMBL190840",
          "CHEMBL191056",
          "CHEMBL191118",
          "CHEMBL191162",
          "CHEMBL191175",
          "CHEMBL1915669",
          "CHEMBL1915670",
          "CHEMBL1915671",
          "CHEMBL1915672",
          "CHEMBL1915673",
          "CHEMBL1915674",
          "CHEMBL1915675",
          "CHEMBL1915676",
          "CHEMBL1915677",
          "CHEMBL1915856",
          "CHEMBL1915857",
          "CHEMBL1915858",
          "CHEMBL1915859",
          "CHEMBL1915860",
          "CHEMBL1915861",
          "CHEMBL1915862",
          "CHEMBL1915863",
          "CHEMBL1915864",
          "CHEMBL1915865",
          "CHEMBL1915866",
          "CHEMBL1915867",
          "CHEMBL191638",
          "CHEMBL1916700",
          "CHEMBL1916708",
          "CHEMBL191898",
          "CHEMBL192613",
          "CHEMBL192661",
          "CHEMBL192662",
          "CHEMBL192729",
          "CHEMBL195456",
          "CHEMBL196779",
          "CHEMBL197319",
          "CHEMBL207203",
          "CHEMBL208260",
          "CHEMBL212943",
          "CHEMBL215442",
          "CHEMBL217941",
          "CHEMBL217988",
          "CHEMBL218071",
          "CHEMBL218123",
          "CHEMBL218263",
          "CHEMBL220802",
          "CHEMBL231709",
          "CHEMBL231746",
          "CHEMBL232156",
          "CHEMBL232330",
          "CHEMBL232362",
          "CHEMBL232578",
          "CHEMBL232767",
          "CHEMBL232768",
          "CHEMBL232964",
          "CHEMBL233170",
          "CHEMBL234391",
          "CHEMBL234598",
          "CHEMBL266622",
          "CHEMBL268051",
          "CHEMBL268477",
          "CHEMBL269403",
          "CHEMBL269520",
          "CHEMBL273530",
          "CHEMBL274054",
          "CHEMBL274393",
          "CHEMBL275124",
          "CHEMBL275233",
          "CHEMBL275245",
          "CHEMBL275493",
          "CHEMBL275667",
          "CHEMBL276885",
          "CHEMBL277158",
          "CHEMBL278451",
          "CHEMBL280223",
          "CHEMBL280247",
          "CHEMBL280442",
          "CHEMBL290969",
          "CHEMBL291630",
          "CHEMBL292717",
          "CHEMBL292964",
          "CHEMBL293242",
          "CHEMBL293647",
          "CHEMBL293697",
          "CHEMBL293856",
          "CHEMBL294108",
          "CHEMBL294585",
          "CHEMBL303532",
          "CHEMBL303763",
          "CHEMBL303787",
          "CHEMBL304225",
          "CHEMBL304887",
          "CHEMBL305126",
          "CHEMBL305568",
          "CHEMBL309835",
          "CHEMBL309987",
          "CHEMBL312697",
          "CHEMBL314533",
          "CHEMBL315391",
          "CHEMBL325026",
          "CHEMBL332635",
          "CHEMBL350832",
          "CHEMBL36041",
          "CHEMBL361812",
          "CHEMBL361939",
          "CHEMBL363350",
          "CHEMBL363800",
          "CHEMBL364841",
          "CHEMBL365501",
          "CHEMBL36817",
          "CHEMBL369797",
          "CHEMBL371394",
          "CHEMBL376053",
          "CHEMBL37853",
          "CHEMBL379203",
          "CHEMBL383484",
          "CHEMBL385126",
          "CHEMBL386580",
          "CHEMBL391933",
          "CHEMBL398063",
          "CHEMBL399000",
          "CHEMBL400404",
          "CHEMBL400405",
          "CHEMBL402162",
          "CHEMBL404199",
          "CHEMBL405770",
          "CHEMBL411255",
          "CHEMBL412070",
          "CHEMBL415310",
          "CHEMBL416334",
          "CHEMBL417069",
          "CHEMBL418338",
          "CHEMBL419040",
          "CHEMBL420398",
          "CHEMBL420404",
          "CHEMBL420507",
          "CHEMBL423815",
          "CHEMBL425681",
          "CHEMBL426387",
          "CHEMBL426559",
          "CHEMBL428524",
          "CHEMBL430121",
          "CHEMBL430124",
          "CHEMBL430154",
          "CHEMBL430286",
          "CHEMBL432522",
          "CHEMBL432935",
          "CHEMBL433249",
          "CHEMBL434002",
          "CHEMBL434173",
          "CHEMBL435382",
          "CHEMBL438092",
          "CHEMBL439357",
          "CHEMBL439934",
          "CHEMBL440164",
          "CHEMBL442405",
          "CHEMBL461390",
          "CHEMBL461571",
          "CHEMBL467114",
          "CHEMBL475152",
          "CHEMBL483991",
          "CHEMBL484778",
          "CHEMBL494",
          "CHEMBL495",
          "CHEMBL521609",
          "CHEMBL550465",
          "CHEMBL550868",
          "CHEMBL551813",
          "CHEMBL552211",
          "CHEMBL556849",
          "CHEMBL557109",
          "CHEMBL557117",
          "CHEMBL560993",
          "CHEMBL561132",
          "CHEMBL563664",
          "CHEMBL564845",
          "CHEMBL564920",
          "CHEMBL565591",
          "CHEMBL565799",
          "CHEMBL565992",
          "CHEMBL591431",
          "CHEMBL597997",
          "CHEMBL598198",
          "CHEMBL599051",
          "CHEMBL599052",
          "CHEMBL59921",
          "CHEMBL599262",
          "CHEMBL601299",
          "CHEMBL603462",
          "CHEMBL603690",
          "CHEMBL604546",
          "CHEMBL605330",
          "CHEMBL60555",
          "CHEMBL60894",
          "CHEMBL62305",
          "CHEMBL62779",
          "CHEMBL62868",
          "CHEMBL62885",
          "CHEMBL62888",
          "CHEMBL63061",
          "CHEMBL64072",
          "CHEMBL64187",
          "CHEMBL64188",
          "CHEMBL64217",
          "CHEMBL64246",
          "CHEMBL64254",
          "CHEMBL64338",
          "CHEMBL64358",
          "CHEMBL64423",
          "CHEMBL64483",
          "CHEMBL64542",
          "CHEMBL64557",
          "CHEMBL64598",
          "CHEMBL64663",
          "CHEMBL64804",
          "CHEMBL64854",
          "CHEMBL79260",
          "CHEMBL79360",
          "CHEMBL79413",
          "CHEMBL79511",
          "CHEMBL815",
          "CHEMBL82489",
          "CHEMBL82896",
          "CHEMBL87371",
          "CHEMBL8935",
          "CHEMBL90491",
          "CHEMBL9166",
          "CHEMBL9172",
          "CHEMBL92539",
          "CHEMBL9367",
          "CHEMBL9368",
          "CHEMBL9371",
          "CHEMBL9398",
          "CHEMBL9441",
          "CHEMBL9442",
          "CHEMBL94694",
          "CHEMBL94751",
          "CHEMBL9540",
          "CHEMBL9541",
          "CHEMBL9552",
          "CHEMBL9558",
          "CHEMBL9573",
          "CHEMBL9580",
          "CHEMBL9583",
          "CHEMBL9604",
          "CHEMBL9626",
          "CHEMBL9639",
          "CHEMBL9648",
          "CHEMBL9649",
          "CHEMBL9690",
          "CHEMBL9744",
          "CHEMBL9846",
          "CHEMBL9868",
          "CHEMBL9873",
          "CHEMBL9883",
          "CHEMBL9910",
          "CHEMBL9936",
          "CHEMBL9953",
          "CHEMBL9998",
          "CHEMBL9999"
        ],
        "number_of_missing_values": "0"
      },
      {
        "data_type": "numeric",
        "index": "1",
        "is_ignore": "false",
        "is_row_identifier": "false",
        "is_target": "false",
        "name": "AMW",
        "number_of_missing_values": "0"
      },
      {
        "data_type": "numeric",
        "index": "2",
        "is_ignore": "false",
        "is_row_identifier": "false",
        "is_target": "false",
        "name": "C.",
        "number_of_missing_values": "0"
      },
      {
        "data_type": "numeric",
        "index": "3",
        "is_ignore": "false",
        "is_row_identifier": "false",
        "is_target": "false",
        "name": "H.",
        "number_of_missing_values": "0"
      },
      {
        "data_type": "numeric",
        "index": "4",
        "is_ignore": "false",
        "is_row_identifier": "false",
        "is_target": "false",
        "name": "Me",
        "number_of_missing_values": "0"
      },
      {
        "data_type": "numeric",
        "index": "5",
        "is_ignore": "false",
        "is_row_identifier": "false",
        "is_target": "false",
        "name": "Mi",
        "number_of_missing_values": "0"
      },
      {
        "data_type": "numeric",
        "index": "6",
        "is_ignore": "false",
        "is_row_identifier": "false",
        "is_target": "false",
        "name": "Mp",
        "number_of_missing_values": "0"
      },
      {
        "data_type": "numeric",
        "index": "7",
        "is_ignore": "false",
        "is_row_identifier": "false",
        "is_target": "false",
        "name": "Mv",
        "number_of_missing_values": "0"
      },
      {
        "data_type": "numeric",
        "index": "8",
        "is_ignore": "false",
        "is_row_identifier": "false",
        "is_target": "false",
        "name": "MW",
        "number_of_missing_values": "0"
      },
      {
        "data_type": "numeric",
        "index": "9",
        "is_ignore": "false",
        "is_row_identifier": "false",
        "is_target": "false",
        "name": "N.",
        "number_of_missing_values": "0"
      },
      {
        "data_type": "numeric",
        "index": "10",
        "is_ignore": "false",
        "is_row_identifier": "false",
        "is_target": "false",
        "name": "nAB",
        "number_of_missing_values": "0"
      },
      {
        "data_type": "numeric",
        "index": "11",
        "is_ignore": "false",
        "is_row_identifier": "false",
        "is_target": "false",
        "name": "nAT",
        "number_of_missing_values": "0"
      },
      {
        "data_type": "numeric",
        "index": "12",
        "is_ignore": "false",
        "is_row_identifier": "false",
        "is_target": "false",
        "name": "nB",
        "number_of_missing_values": "0"
      },
      {
        "data_type": "numeric",
        "index": "13",
        "is_ignore": "false",
        "is_row_identifier": "false",
        "is_target": "false",
        "name": "nBM",
        "number_of_missing_values": "0"
      },
      {
        "data_type": "numeric",
        "index": "14",
        "is_ignore": "false",
        "is_row_identifier": "false",
        "is_target": "false",
        "name": "nBO",
        "number_of_missing_values": "0"
      },
      {
        "data_type": "numeric",
        "index": "15",
        "is_ignore": "false",
        "is_row_identifier": "false",
        "is_target": "false",
        "name": "nBR",
        "number_of_missing_values": "0"
      },
      {
        "data_type": "numeric",
        "index": "16",
        "is_ignore": "false",
        "is_row_identifier": "false",
        "is_target": "false",
        "name": "nBT",
        "number_of_missing_values": "0"
      },
      {
        "data_type": "numeric",
        "index": "17",
        "is_ignore": "false",
        "is_row_identifier": "false",
        "is_target": "false",
        "name": "nC",
        "number_of_missing_values": "0"
      },
      {
        "data_type": "numeric",
        "index": "18",
        "is_ignore": "false",
        "is_row_identifier": "false",
        "is_target": "false",
        "name": "nCL",
        "number_of_missing_values": "0"
      },
      {
        "data_type": "numeric",
        "index": "19",
        "is_ignore": "false",
        "is_row_identifier": "false",
        "is_target": "false",
        "name": "nCsp",
        "number_of_missing_values": "0"
      },
      {
        "data_type": "numeric",
        "index": "20",
        "is_ignore": "false",
        "is_row_identifier": "false",
        "is_target": "false",
        "name": "nCsp2",
        "number_of_missing_values": "0"
      },
      {
        "data_type": "numeric",
        "index": "21",
        "is_ignore": "false",
        "is_row_identifier": "false",
        "is_target": "false",
        "name": "nCsp3",
        "number_of_missing_values": "0"
      },
      {
        "data_type": "numeric",
        "index": "22",
        "is_ignore": "false",
        "is_row_identifier": "false",
        "is_target": "false",
        "name": "nDB",
        "number_of_missing_values": "0"
      },
      {
        "data_type": "numeric",
        "index": "23",
        "is_ignore": "false",
        "is_row_identifier": "false",
        "is_target": "false",
        "name": "nF",
        "number_of_missing_values": "0"
      },
      {
        "data_type": "numeric",
        "index": "24",
        "is_ignore": "false",
        "is_row_identifier": "false",
        "is_target": "false",
        "name": "nH",
        "number_of_missing_values": "0"
      },
      {
        "data_type": "numeric",
        "index": "25",
        "is_ignore": "false",
        "is_row_identifier": "false",
        "is_target": "false",
        "name": "nHet",
        "number_of_missing_values": "0"
      },
      {
        "data_type": "numeric",
        "index": "26",
        "is_ignore": "false",
        "is_row_identifier": "false",
        "is_target": "false",
        "name": "nHM",
        "number_of_missing_values": "0"
      },
      {
        "data_type": "numeric",
        "index": "27",
        "is_ignore": "false",
        "is_row_identifier": "false",
        "is_target": "false",
        "name": "nI",
        "number_of_missing_values": "0"
      },
      {
        "data_type": "numeric",
        "index": "28",
        "is_ignore": "false",
        "is_row_identifier": "false",
        "is_target": "false",
        "name": "nN",
        "number_of_missing_values": "0"
      },
      {
        "data_type": "numeric",
        "index": "29",
        "is_ignore": "false",
        "is_row_identifier": "false",
        "is_target": "false",
        "name": "nO",
        "number_of_missing_values": "0"
      },
      {
        "data_type": "numeric",
        "index": "30",
        "is_ignore": "false",
        "is_row_identifier": "false",
        "is_target": "false",
        "name": "nP",
        "number_of_missing_values": "0"
      },
      {
        "data_type": "numeric",
        "index": "31",
        "is_ignore": "false",
        "is_row_identifier": "false",
        "is_target": "false",
        "name": "nS",
        "number_of_missing_values": "0"
      },
      {
        "data_type": "numeric",
        "index": "32",
        "is_ignore": "false",
        "is_row_identifier": "false",
        "is_target": "false",
        "name": "nSK",
        "number_of_missing_values": "0"
      },
      {
        "data_type": "numeric",
        "index": "33",
        "is_ignore": "false",
        "is_row_identifier": "false",
        "is_target": "false",
        "name": "nTB",
        "number_of_missing_values": "0"
      },
      {
        "data_type": "numeric",
        "index": "34",
        "is_ignore": "false",
        "is_row_identifier": "false",
        "is_target": "false",
        "name": "nX",
        "number_of_missing_values": "0"
      },
      {
        "data_type": "numeric",
        "index": "35",
        "is_ignore": "false",
        "is_row_identifier": "false",
        "is_target": "false",
        "name": "O.",
        "number_of_missing_values": "0"
      },
      {
        "data_type": "numeric",
        "index": "36",
        "is_ignore": "false",
        "is_row_identifier": "false",
        "is_target": "false",
        "name": "RBF",
        "number_of_missing_values": "0"
      },
      {
        "data_type": "numeric",
        "index": "37",
        "is_ignore": "false",
        "is_row_identifier": "false",
        "is_target": "false",
        "name": "RBN",
        "number_of_missing_values": "0"
      },
      {
        "data_type": "numeric",
        "index": "38",
        "is_ignore": "false",
        "is_row_identifier": "false",
        "is_target": "false",
        "name": "SCBO",
        "number_of_missing_values": "0"
      },
      {
        "data_type": "numeric",
        "index": "39",
        "is_ignore": "false",
        "is_row_identifier": "false",
        "is_target": "false",
        "name": "Se",
        "number_of_missing_values": "0"
      },
      {
        "data_type": "numeric",
        "index": "40",
        "is_ignore": "false",
        "is_row_identifier": "false",
        "is_target": "false",
        "name": "Si",
        "number_of_missing_values": "0"
      },
      {
        "data_type": "numeric",
        "index": "41",
        "is_ignore": "false",
        "is_row_identifier": "false",
        "is_target": "false",
        "name": "Sp",
        "number_of_missing_values": "0"
      },
      {
        "data_type": "numeric",
        "index": "42",
        "is_ignore": "false",
        "is_row_identifier": "false",
        "is_target": "false",
        "name": "Sv",
        "number_of_missing_values": "0"
      },
      {
        "data_type": "numeric",
        "index": "43",
        "is_ignore": "false",
        "is_row_identifier": "false",
        "is_target": "false",
        "name": "X.",
        "number_of_missing_values": "0"
      },
      {
        "data_type": "numeric",
        "index": "44",
        "is_ignore": "false",
        "is_row_identifier": "false",
        "is_target": "true",
        "name": "pXC50",
        "number_of_missing_values": "0"
      }
    ]
  }
}